program: Gaussian 09
title: 000087002
version: EM64L-G09RevD.01
frameworkgroup: C1[X(C10H9Cl2NO4)]
method: RPBEPBE
basis: SDD
operation: Freq
keyword: #p
keyword: freq=noraman
keyword: PBEPBE/SDD
title: #p freq=noraman PBEPBE/SDD
converged: YES YES NO NO
title: Mulliken charges:
elementType: Cl Cl O O O O N C C C C C C C C C C H H H H H H H H H
charge: -0.014725 -0.044195 -0.267880 -0.261576 -0.442880 -0.212099 -0.374518 -0.442823 0.506974 0.205673 -0.387975 -0.305353 -0.299884 -0.195813 -0.226862 -0.113194 0.187991 0.270795 0.247181 0.393635 0.280995 0.282947 0.269738 0.283333 0.261777 0.398739
chargesum: 0.00000
title: Mulliken charges with hydrogens summed into heavy atoms:
elementType: Cl Cl O O O O N C C C C C C C C C C
charge: -0.014725 -0.044195 -0.267880 -0.261576 -0.044141 -0.212099 0.019117 0.075153 0.506974 0.205673 0.175967 -0.305353 -0.030146 0.087520 0.034915 -0.113194 0.187991
polarizability: 1.59117418e+02 2.65703411e+01 1.26003006e+02 1.01088687e+01 -9.63568219e+00 1.46506845e+02
1716.lowfreq: -7.5534 -7.1444 0.0025 0.0026 0.0036 2.8970 12.1596 21.2799 30.5679
frequency: 12.1484 20.9219 30.5460 46.1059 57.9338 78.0458 118.9374 158.9213 165.8461 172.4887 203.6359 225.6516 257.9404 301.6798 336.7212 365.3625 388.5674 418.2018 441.0780 464.7202 494.1557 542.2238 548.1628 561.8819 578.6113 618.9676 645.7354 657.3318 685.2507 699.1675 702.8801 795.2238 803.9545 823.2284 862.8579 929.5805 932.4256 979.7209 983.3778 1001.0690 1031.3279 1078.0742 1086.5970 1123.8419 1153.3776 1205.0922 1216.6321 1231.7813 1237.6656 1256.0366 1304.5564 1325.5243 1333.5460 1361.7157 1385.9047 1455.7588 1458.3455 1460.7075 1495.2883 1572.0076 1593.7230 1620.3382 1685.8473 2992.6655 3027.0304 3033.5360 3097.4482 3159.5285 3180.1426 3183.7325 3516.4551 3536.7547
redmass: 9.4503 10.2282 7.0360 5.8365 8.9868 7.0124 8.0513 4.9364 5.9628 8.8156 4.5498 7.4838 8.1156 4.3252 8.1370 6.4464 8.7426 6.5860 3.3859 6.5560 1.9043 4.2806 4.1507 4.0033 4.3551 7.1526 1.4279 4.5963 6.5723 2.4354 1.4066 7.1902 1.4182 4.7763 1.3879 6.1562 1.3386 2.2304 5.3859 2.1269 4.0123 2.0302 2.5293 4.7678 1.3211 1.6199 1.0960 1.9620 1.5618 1.3736 2.4160 1.3001 1.5786 4.8172 5.3157 1.2483 1.4818 1.3191 2.2403 7.5799 7.6750 9.1984 9.3929 1.0612 1.0586 1.0985 1.1058 1.0885 1.0963 1.0939 1.0781 1.0646
irintensity: 0.0470 0.7157 4.2201 3.1389 4.3666 0.8462 0.1172 0.0446 0.1329 0.8289 5.0195 16.7321 2.1996 5.8503 5.8707 1.3516 1.4240 6.7403 4.8115 28.9688 37.6171 31.1243 5.8814 1.5702 9.7791 31.8836 104.0664 8.4857 62.9409 52.8680 91.9309 27.5032 54.1075 15.2144 20.6844 68.0923 0.5864 11.0631 9.6234 3.3714 64.7900 182.8417 54.0172 7.6935 2.5562 42.7288 0.8154 114.3950 14.9032 57.2278 45.9918 5.7403 4.8899 20.1990 2.9729 105.3523 133.5767 99.6858 244.5624 21.9232 6.2693 213.2583 263.5692 21.0767 19.4947 4.3194 5.8878 3.0926 0.3649 1.0753 65.2094 41.7441
temp: 298.150 k
press: 1.00000 atm
elementType: 17 17 8 8 8 8 7 6 6 6 6 6 6 6 6 6 6 1 1 1 1 1 1 1 1 1
symmnumber: 1
zpe: 469607.5 jmol-1
zpe.correction: 0.178864 hartree
zpe.thermalcorrener: 0.195719 hartree
zpe.thermalcorrenthalpy: 0.196663 hartree
zpe.thermalcorrgfe: 0.129761 hartree
zpe.sumelectzpe: -1660.981953 hartree
zpe.sumelectthermal: -1660.965098 hartree
zpe.sumelectthermalent: -1660.964154 hartree
zpe.sumelectthermalfe: -1661.031056 hartree
dipole: 0.1335 -0.5346 1.4109
dipole: 1.5147
quadrupole: -125.7512 -116.4091 -111.2707
quadrupole: 4.7822 -8.6469 2.3532
quadrupole: -7.9409 1.4012 6.5396 4.7822 -8.6469 2.3532
hfenergy: -1661.160817 hartree
pointgroup: C01 [X(C10H9Cl2N1O4)]
dipole: -0.0392175 0.2918953 -0.5180528 debye
dipolederiv: -0.0920992 0.1135474 -0.0837435 0.1170837 -0.3467369 0.2817097 -0.0989728 0.3375482 -0.4055392 -0.3623965 0.3550478 0.0969408 0.3893456 -0.5232756 -0.0986091 0.1142951 -0.1057306 -0.1499557 -1.0289794 0.4551802 0.4704356 0.6496458 -0.8476236 -0.4812424 0.4617186 -0.3007308 -0.5334138 -0.6038939 -0.0227528 0.1948266 -0.1546638 -0.370951 0.0925736 -0.0854372 -0.2217066 -1.0237185 -0.5974308 -0.0747807 0.2728309 -0.093764 -0.4356109 0.1722535 0.3758707 0.2422355 -0.9167621 -0.85375 -0.3334996 0.0668513 -0.4342058 -0.5822816 0.0322901 -0.1446129 -0.1021448 -0.541177 -0.8474613 -0.1595469 -0.2446405 -0.246381 -0.5322324 -0.2120412 -0.3041831 -0.2361744 -0.8027327 0.3937702 -0.1637996 -0.1663906 -0.247137 0.2259003 0.1671357 -0.4107355 0.3343474 0.5550749 0.7372186 -0.4550698 -0.3860134 -0.7643734 0.6375789 0.6148566 -0.1767863 0.2815037 -0.0622677 0.8411226 0.2665499 0.0701926 0.4655142 0.349617 0.0784959 0.3496206 0.3020065 1.3741034 0.4960473 0.0451569 -0.0356379 0.1085284 0.2928447 -0.0518597 -0.2017434 -0.1523542 -0.1483806 -0.0676289 -0.1524364 0.144896 -0.1273136 0.3838398 -0.5039546 0.2243087 -0.6277896 0.5665494 -0.1995699 -0.0317199 0.0780899 0.0748251 -0.1354869 -0.2010372 -0.1458845 0.0622377 -0.0087421 -0.1331617 0.121059 -0.0141507 0.1226544 -0.2470333 0.0438347 -0.0031371 0.062129 -0.1207618 -0.1473154 0.0814531 -0.0322357 0.0381284 -0.1649574 -0.0036519 0.0452778 -0.1050154 0.0273724 0.3934295 -0.5864857 -0.1547053 -0.6047244 0.6788101 0.1393051 -0.1881963 0.1731946 0.0985822 1.0919446 0.5753622 -0.1994031 0.6874648 0.662631 -0.0504103 -0.0777716 0.0041414 1.3070581 0.0360926 0.0641866 0.0479106 0.0408015 -0.0358328 -0.0276597 0.0574578 0.0196616 0.0655019 -0.0606914 -0.0078514 -0.0550147 0.0274498 0.1230809 0.0633927 -0.0072382 -0.0500181 -0.0443759 0.3863931 -0.0910345 -0.0203903 -0.0165064 0.266547 0.012249 0.0795212 0.0342935 0.2345251 -0.0800594 -0.010332 -0.0075865 0.0177377 0.0395738 -0.0579328 0.0648953 -0.0162862 0.0973769 0.0405122 0.001754 -0.0664482 -0.0470974 -0.0138114 0.0171933 0.0147662 0.0720919 0.0887441 0.1330384 0.0458115 0.0668369 0.0324564 0.0943989 -0.0077475 0.0858176 -0.0131633 -0.0139796 0.1317544 0.0314647 0.0398725 0.0328337 0.1245679 -0.0012895 0.0408154 0.0017033 0.0350239 0.1314326 0.0511829 -0.0057398 0.0587424 0.0590304 0.0633003 -0.0087189 0.0658698 0.0440282 0.2616815 -0.1184471 -0.0775835 -0.1270447 0.297413 -0.0811545 -0.0609474 -0.0618502 0.2778661 unknown
polarizability: 137.9537259|-29.5310859|141.2106297|-15.8056468|-0.7013197|152.4629142 unknown
InChI: InChI=1S/C10H9Cl2NO4/c11-6-1-2-8(7(12)3-6)17-5-9(14)13-4-10(15)16/h1-3,13,15H,4-5H2
charge 0 multiplicity 1
26 atoms
Cl 1.325824 1.903022 -2.807232
Cl 4.00381 -2.678108 -1.172122
O  0.396449 2.021515 -0.004078
O  -1.545008 1.238056 3.012752
O  -3.09181 -0.131262 -1.395959
O  -4.745934 -1.323791 -0.272105
N  -2.006427 0.896678 0.752823
C  -0.080397 2.298358 1.360757
C  1.221328 0.90234 -0.195843
C  -1.269392 1.416335 1.787059
C  -3.172198 0.053861 1.015589
C  1.748073 0.720246 -1.501232
C  1.555044 -0.038489 0.809639
C  2.591655 -0.361103 -1.808725
C  2.403467 -1.129983 0.518304
C  2.910469 -1.275482 -0.784551
C  -3.768988 -0.55183 -0.242708
H  -0.40481 3.351974 1.326326
H  0.72591 2.200396 2.108943
H  -1.728142 1.06374 -0.219365
H  -3.970507 0.62477 1.530046
H  -2.911715 -0.769901 1.707866
H  1.153463 0.058845 1.822203
H  2.988866 -0.481527 -2.81942
H  2.657405 -1.852548 1.298293
H  -3.499634 -0.539709 -2.205563
