program: Gaussian 09
title: 000085007
version: EM64L-G09RevD.01
frameworkgroup: C1[X(C12H13NO3S)]
method: RPBEPBE
basis: SDD
operation: Freq
keyword: #p
keyword: freq=noraman
keyword: PBEPBE/SDD
title: #p freq=noraman PBEPBE/SDD
converged: YES YES NO NO
title: Mulliken charges:
elementType: S O O O N C C C C C C C C C C C C H H H H H H H H H H H H H
charge: 1.050547 -0.399823 -0.512678 -0.551034 -0.069940 -0.419578 -0.355575 -0.587690 -0.292680 0.337383 0.358941 -0.170220 -0.411107 -0.367171 -0.411763 -0.251398 -0.228781 0.230718 0.258610 0.267100 0.231724 0.292204 0.281875 0.306459 0.236423 0.234434 0.249747 0.232616 0.231748 0.228911
chargesum: 0.00000
title: Mulliken charges with hydrogens summed into heavy atoms:
elementType: S O O O N C C C C C C C C C C C C
charge: 1.050547 -0.399823 -0.512678 -0.551034 -0.069940 0.069749 0.143249 -0.013611 0.013779 0.337383 0.358941 0.066203 -0.176673 -0.117423 -0.179147 -0.019651 0.000130
polarizability: 2.63776221e+02 7.21394347e+00 1.88784220e+02 7.68984249e+00 -5.92772426e+00 1.08359965e+02
1716.lowfreq: -9.0461 -0.0016 -0.0014 -0.0009 5.6518 8.3014 47.9629 63.1185 81.4708
frequency: 47.9323 63.0293 81.4125 120.4094 149.8911 174.7990 189.2321 202.4874 238.3108 261.6148 277.9510 297.7542 327.8520 345.6969 390.0430 413.7772 421.5383 438.1757 469.3372 486.0021 524.1556 528.3350 559.7643 589.3672 631.1420 683.6890 703.8916 740.5327 762.5670 788.9437 793.3742 794.1152 827.0607 844.2051 868.4096 882.9437 918.7119 936.2782 946.9365 960.2558 971.6607 989.8657 1014.4504 1033.1676 1060.9039 1105.7828 1127.0273 1147.6541 1172.5395 1178.7622 1207.5227 1220.1602 1231.8622 1238.8834 1272.1927 1278.2915 1303.5107 1336.7197 1343.8532 1356.0754 1382.8709 1393.4544 1416.8947 1431.3590 1437.5687 1453.3479 1473.0805 1495.5916 1564.9621 1617.9467 1633.8398 2988.0393 3011.0534 3021.3070 3046.2162 3071.4676 3077.1739 3124.1055 3134.1057 3142.2762 3146.2249 3148.1684 3166.2765 3178.0603
redmass: 4.9666 4.0735 5.6529 5.0602 4.4165 5.8955 4.1633 4.7152 5.7589 5.4329 4.5792 3.3528 5.1569 10.3424 3.6970 3.4215 7.8069 3.9412 3.8010 4.2347 5.9112 3.9775 4.3418 3.6834 6.6754 5.1671 3.9009 1.3362 2.8366 1.7414 2.7800 2.2570 4.9549 2.9766 3.1624 1.6487 1.3029 4.9655 3.7203 1.4715 2.1054 1.3375 2.3153 2.2616 2.7833 2.1057 1.4521 1.5100 1.2370 1.2631 1.3267 1.9780 1.6198 1.4777 1.4312 1.3484 1.1381 1.5157 1.5205 1.2703 1.4844 8.1922 1.1040 1.9976 1.0857 1.9810 1.2006 3.1875 5.9803 6.4412 6.3188 1.0649 1.0617 1.0882 1.0578 1.0965 1.1043 1.0861 1.0890 1.1102 1.0949 1.0878 1.1004 1.0986
irintensity: 4.9759 1.3630 1.1652 4.2654 0.4329 6.8194 2.3403 5.7329 12.8358 7.7744 11.2646 3.4022 5.3124 1.3674 25.5189 2.3231 149.0224 18.4295 8.1390 9.9459 0.3356 11.4347 138.6431 1.2083 12.8612 95.3446 3.0761 2.6569 13.1260 74.3855 34.5632 33.8074 34.5431 21.8287 2.7570 8.7013 0.7881 91.2269 33.1911 1.5649 4.3617 0.4291 17.0672 6.0060 2.7470 5.7783 11.2321 10.3194 15.1695 20.3791 41.2173 4.4013 6.2214 12.6190 4.4918 4.5949 26.6068 2.0668 10.3238 22.4099 15.2009 6.3481 11.1359 8.3472 8.5098 13.2803 29.0043 28.8883 9.8803 5.8529 80.4380 12.1135 32.5487 10.3564 3.3903 11.5103 9.9512 4.2190 1.4430 0.8366 28.6805 1.1929 31.5576 15.1656
temp: 298.150 k
press: 1.00000 atm
elementType: 16 8 8 8 7 6 6 6 6 6 6 6 6 6 6 6 6 1 1 1 1 1 1 1 1 1 1 1 1 1
symmnumber: 1
zpe: 603086.6 jmol-1
zpe.correction: 0.229704 hartree
zpe.thermalcorrener: 0.244759 hartree
zpe.thermalcorrenthalpy: 0.245703 hartree
zpe.thermalcorrgfe: 0.187902 hartree
zpe.sumelectzpe: -1142.140947 hartree
zpe.sumelectthermal: -1142.125892 hartree
zpe.sumelectthermalent: -1142.124947 hartree
zpe.sumelectthermalfe: -1142.182748 hartree
dipole: -0.0719 6.5213 0.2754
dipole: 6.5275
quadrupole: -94.6797 -103.7280 -114.5235
quadrupole: 18.7806 0.9598 -4.4618
quadrupole: 9.6307 0.5824 -10.2131 18.7806 0.9598 -4.4618
hfenergy: -1142.3706508 hartree
pointgroup: C01 [X(C12H13N1O3S1)]
dipole: -0.0767289 -2.5082222 -0.5460183 debye
polarizability: 258.4966245|-3.7772708|188.2736067|-29.7952979|8.6634352|114.1501748 unknown
InChI: InChI=1S/C12H13NO3S/c14-17(15)9-3-7-13-8-6-10-4-1-2-5-11(10)12(13)16-17/h1-2,4-6,8,12H,3,7,9H2
charge 0 multiplicity 1
30 atoms
S  2.325191 1.356475 -0.067925
O  0.652074 0.760582 0.530948
O  2.965504 2.33659 1.043708
O  2.150957 1.859298 -1.614013
N  -0.021316 -1.075357 -0.94706
C  1.31088 -1.405016 -1.495162
C  2.420211 -1.533838 -0.390116
C  3.327074 -0.323715 -0.157444
C  -0.278322 0.315261 -0.643757
C  -1.665473 0.59134 -0.138081
C  -2.474786 -0.476127 0.366903
C  -0.791066 -2.089385 -0.369431
C  -1.979886 -1.838627 0.272814
C  -2.143638 1.922907 -0.113619
C  -3.757499 -0.163642 0.904928
C  -3.417113 2.213036 0.412084
C  -4.22183 1.162429 0.929071
H  1.229022 -2.3652 -2.032807
H  1.588842 -0.628742 -2.231555
H  1.934766 -1.828035 0.556348
H  3.099483 -2.361412 -0.678344
H  4.023046 -0.115512 -0.986534
H  3.847937 -0.351321 0.811837
H  0.025926 0.959403 -1.489151
H  -0.40274 -3.104085 -0.50045
H  -2.568407 -2.669323 0.670038
H  -1.505187 2.730166 -0.49041
H  -4.382589 -0.974985 1.296332
H  -3.782466 3.24497 0.430084
H  -5.209796 1.388062 1.345865
