program: Gaussian 09
title: 000086429
version: EM64L-G09RevD.01
frameworkgroup: C1[X(C14H13F4N3O2S)]
method: RPBEPBE
basis: SDD
operation: Freq
keyword: #p
keyword: freq=noraman
keyword: PBEPBE/SDD
title: #p freq=noraman PBEPBE/SDD
converged: YES YES NO NO
title: Mulliken charges:
elementType: S F F F F O O N N N C C C C C C C C C C C C C C H H H H H H H H H H H H H
charge: 0.370355 -0.197695 -0.143143 -0.158403 -0.140425 -0.176990 -0.252261 -0.240931 -0.083239 -0.010023 -0.063532 0.332938 -0.675800 -0.686636 0.178313 -0.389309 -0.264035 -0.315875 -0.380255 -0.369764 0.329880 -0.060167 -0.224672 0.392540 0.261628 0.221402 0.221518 0.243360 0.218221 0.227421 0.226219 0.268840 0.257790 0.293223 0.258255 0.268248 0.263003
chargesum: 0.00000
title: Mulliken charges with hydrogens summed into heavy atoms:
elementType: S F F F F O O N N N C C C C C C C C C C C C C C
charge: 0.370355 -0.197695 -0.143143 -0.158403 -0.140425 -0.176990 -0.252261 -0.240931 -0.083239 -0.010023 0.198096 0.332938 0.010480 -0.014774 0.178313 0.137322 0.029187 -0.057620 -0.112007 -0.106761 0.329880 -0.060167 -0.224672 0.392540
polarizability: 2.46779220e+02 1.23902436e+01 1.81108663e+02 -1.12148138e+01 1.34825962e+01 1.59023237e+02
1716.lowfreq: -5.9209 -0.0005 0.0013 0.0016 1.1090 4.7663 11.8957 16.7906 22.4931
frequency: 10.9972 16.4506 22.3943 36.3074 42.4019 50.9534 54.7199 73.9134 87.5090 106.8355 121.1246 158.8607 184.1871 199.1773 216.7933 226.5870 256.3742 261.0854 279.9210 290.6062 299.1609 332.8623 352.5794 365.4031 376.5647 382.9123 407.0592 419.6084 445.6276 478.2487 482.7570 486.5760 492.4841 559.3095 564.4168 577.6621 593.0489 599.0235 609.3602 634.5651 641.3249 675.5060 715.3359 730.0599 742.1967 795.4281 817.7083 832.0437 848.4931 911.1615 926.3381 928.9054 936.1162 944.7816 946.0749 960.2605 963.7856 998.4551 1005.5144 1010.2089 1018.3420 1053.7642 1099.2227 1118.2119 1141.6683 1143.6234 1155.6481 1182.0432 1194.6754 1217.9104 1238.7731 1253.7419 1282.6713 1287.9402 1332.3143 1341.7782 1362.1527 1381.3806 1392.6388 1399.2535 1402.7036 1406.8045 1443.5140 1454.0943 1465.9363 1468.9207 1477.9394 1487.7584 1491.0030 1591.8731 1595.7802 1610.5801 2984.2231 2986.7371 3039.3121 3054.0640 3080.2814 3086.0589 3089.6445 3094.2832 3132.1215 3155.9435 3163.2582 3178.9190 3182.3162
redmass: 17.1323 8.9939 5.1997 3.5622 4.4562 8.9232 7.6287 10.1146 12.3979 5.7432 5.0907 6.1190 6.1379 3.9159 8.1726 1.0679 2.7060 1.3193 4.6138 9.1158 4.7176 6.0366 11.8292 5.6346 13.9189 5.1554 5.0230 3.0057 3.9579 8.8459 4.9268 8.0131 4.2671 4.0027 3.8767 10.3135 11.7883 4.1006 13.3001 7.0207 15.5252 9.4883 5.0217 8.3024 6.3947 5.6924 1.2527 2.1216 2.4258 3.8769 1.3777 9.4531 2.7149 1.4832 1.4300 1.3754 2.8144 2.6166 2.6129 12.8030 8.8275 10.6402 1.2990 1.9251 9.5098 2.5408 1.3866 2.0238 2.1189 1.5391 2.5159 6.6292 2.0300 1.2704 1.4472 1.7694 6.9863 1.2262 1.7094 1.2286 3.1314 2.3865 7.8454 1.7620 1.0469 1.0502 1.0798 1.0766 2.3913 8.4909 8.2255 7.0561 1.0353 1.0361 1.0860 1.0565 1.0997 1.1003 1.0983 1.1005 1.1082 1.0895 1.0896 1.0968 1.0978
irintensity: 0.0244 0.2716 1.0265 0.6016 1.4019 1.2735 1.2514 2.1608 1.9014 0.3415 0.0488 2.0793 1.4632 6.1193 5.6519 0.0410 5.1829 1.2010 0.5128 4.0849 1.1559 1.6518 3.2536 2.3672 0.1610 3.3076 14.9505 0.6303 4.9012 1.7501 5.7702 1.0088 21.1797 12.3377 9.9343 21.1980 3.6467 28.7273 1.8910 5.9744 19.3696 1.8905 2.3945 13.6245 29.9568 16.8122 0.7210 47.1283 22.8651 59.1869 5.1637 207.1101 1.2256 4.6342 0.3753 3.5798 34.2970 7.1934 14.5605 245.7813 186.5060 58.0256 11.4078 89.1576 44.4063 13.1029 46.6993 14.7820 52.7146 61.6951 102.3626 286.1051 24.0496 1.1872 15.5502 48.4644 2.5038 28.3082 39.6099 7.6806 11.7328 180.7270 202.2289 78.2617 2.7582 1.0637 45.9359 8.2158 179.0713 84.2593 104.5771 131.9578 19.5696 17.1315 5.6785 11.7020 1.1782 24.9405 61.8855 23.6357 3.7499 4.3575 1.0311 0.8209 2.1616
temp: 298.150 k
press: 1.00000 atm
elementType: 16 9 9 9 9 8 8 7 7 7 6 6 6 6 6 6 6 6 6 6 6 6 6 6 1 1 1 1 1 1 1 1 1 1 1 1 1
symmnumber: 1
zpe: 671152.6 jmol-1
zpe.correction: 0.255629 hartree
zpe.thermalcorrener: 0.279025 hartree
zpe.thermalcorrenthalpy: 0.279969 hartree
zpe.thermalcorrgfe: 0.198143 hartree
zpe.sumelectzpe: -1651.600222 hartree
zpe.sumelectthermal: -1651.576826 hartree
zpe.sumelectthermalent: -1651.575882 hartree
zpe.sumelectthermalfe: -1651.657708 hartree
dipole: 5.2158 -0.6806 -1.7311
dipole: 5.5376
quadrupole: -148.2484 -157.1995 -141.3110
quadrupole: -8.7636 3.5157 -4.3309
quadrupole: 0.6712 -8.2798 7.6086 -8.7636 3.5157 -4.3309
hfenergy: -1651.855851 hartree
pointgroup: C01 [X(C14H13F4N3O2S1)]
dipole: -1.8811121 -0.4037496 -1.0222003 debye
polarizability: 234.2449787|31.2057288|176.5436195|17.9244461|-11.4715622|176.1225223 unknown
InChI: InChI=1S/C14H13F4N3O2S/c1-8(2)21(10-5-3-9(15)4-6-10)11(22)7-23-13-20-19-12(24-13)14(16,17)18/h3-6,8H,7H2,1-2H3
charge 0 multiplicity 1
37 atoms
S  3.457487 0.528532 -1.026215
F  -4.196805 -4.1855 0.795248
F  4.724228 -0.488546 2.505657
F  5.630316 0.929682 0.977626
F  4.254204 1.721619 2.605226
O  1.018841 0.012636 -2.166423
O  -0.601485 2.230293 -1.684295
N  -2.300017 0.901673 -0.76815
N  1.132937 -0.002756 0.225403
N  2.07102 0.170817 1.244679
C  -2.984908 2.123791 -0.204971
C  -2.776842 -0.412538 -0.38004
C  -2.727598 2.242983 1.314043
C  -4.486953 2.146311 -0.547466
C  -1.113639 1.09255 -1.469269
C  -0.457569 -0.177425 -2.058595
C  -2.203363 -1.068285 0.740743
C  -3.826099 -1.032653 -1.102962
C  -2.67409 -2.337454 1.138418
C  -4.309562 -2.301038 -0.713475
C  -3.720638 -2.921382 0.402327
C  1.676074 0.145072 -0.994217
C  3.289423 0.439824 0.791839
C  4.45308 0.64804 1.713104
H  -2.480522 2.964627 -0.713339
H  -3.150425 3.193043 1.687526
H  -3.204508 1.417428 1.873006
H  -1.645282 2.240466 1.530832
H  -4.651041 2.082489 -1.637988
H  -4.923511 3.097317 -0.193228
H  -5.034198 1.321515 -0.056714
H  -0.653565 -1.083528 -1.465738
H  -0.769049 -0.320593 -3.104867
H  -1.371622 -0.594202 1.270694
H  -4.258179 -0.522197 -1.969156
H  -2.242294 -2.864964 1.993501
H  -5.117347 -2.799949 -1.256164
