program: Gaussian 09
title: 000084986
version: EM64L-G09RevD.01
frameworkgroup: C1[X(C10H13ClN3)]
method: RPBEPBE
basis: SDD
operation: Freq
keyword: #p
keyword: freq=noraman
keyword: PBEPBE/SDD
title: #p freq=noraman PBEPBE/SDD
converged: YES YES NO NO
title: Mulliken charges:
elementType: Cl N N N C C C C C C C C C C H H H H H H H H H H H H H
charge: 0.044750 -0.123015 -0.024032 0.114194 -0.409673 -0.392965 0.581586 -0.632093 -0.653722 -0.275659 -0.267086 -0.342362 -0.396291 0.426862 0.257317 0.259340 0.256112 0.245476 0.226021 0.240416 0.252731 0.236695 0.247807 0.255469 0.281286 0.304246 0.286589
chargesum: 1.00000
title: Mulliken charges with hydrogens summed into heavy atoms:
elementType: Cl N N N C C C C C C C C C C
charge: 0.044750 -0.123015 -0.024032 0.114194 0.106984 0.108623 0.581586 0.087075 0.086249 -0.275659 0.014200 -0.038116 -0.109701 0.426862
polarizability: 2.90178177e+02 -9.39890239e-01 1.33065192e+02 6.51042207e+00 4.06627138e+00 7.46756981e+01
1716.lowfreq: -5.4230 -3.6768 -0.0029 -0.0025 -0.0015 8.0728 38.6347 66.4946 103.0168
frequency: 38.6030 66.4024 102.9921 117.1736 139.7557 144.9186 174.0142 203.8214 209.2679 226.8048 272.1543 302.7038 333.6605 343.7868 387.5179 424.0505 455.0583 477.6943 493.9410 509.0452 551.7083 579.9384 644.0892 662.3025 709.3208 783.5311 788.8698 802.8314 837.2066 881.9521 898.1372 921.7989 962.6028 1006.3011 1019.4177 1056.1839 1077.2450 1091.1114 1137.0029 1157.3451 1189.9337 1208.5817 1266.6619 1277.9983 1292.1813 1335.8643 1340.4039 1354.5868 1392.4687 1398.5671 1404.1023 1455.3173 1467.6712 1470.2374 1475.6374 1485.3280 1487.8220 1504.4861 1514.3046 1527.8977 1608.5274 2061.0631 3001.8356 3002.1100 3003.8604 3010.4160 3084.8104 3093.9733 3102.8132 3109.2417 3113.0556 3133.0187 3174.5154 3177.2170 3208.1085
redmass: 5.0040 3.7503 3.5145 3.4965 5.3816 5.7033 4.0132 1.0723 1.1529 4.2685 6.0497 2.4857 4.7632 3.3970 6.9515 3.4329 6.0433 3.2268 4.5336 4.5459 4.0854 5.1758 3.6442 7.8144 3.6431 1.3377 1.1298 1.6045 3.7079 1.4018 3.0435 2.0548 1.3244 3.2567 2.6753 3.1595 1.8034 2.0196 1.9618 1.8076 1.4895 2.7119 1.2454 1.2475 1.4789 1.4576 1.4009 1.9876 1.7100 1.2947 1.1911 4.0884 1.0515 1.0697 1.1115 1.0934 1.2284 1.2659 5.7540 1.9320 6.3466 13.8549 1.0378 1.0369 1.0697 1.0675 1.0969 1.0990 1.0988 1.1012 1.0995 1.0941 1.0919 1.0943 1.0943
irintensity: 0.5708 0.3481 0.2321 0.1660 0.4343 0.1155 1.7261 0.3175 0.0517 2.0201 0.9842 0.3940 0.8611 0.5686 2.0405 12.8290 2.3145 0.6349 0.3005 7.7852 7.8413 1.5516 1.4315 6.5757 2.4285 22.0104 12.8654 37.6356 24.7786 33.0627 2.3428 0.6761 0.4887 21.4085 13.4150 16.1969 24.0785 21.5751 16.4571 5.7503 31.5481 118.9473 11.9837 19.4681 4.5933 46.2714 8.9125 18.4066 12.0221 6.9504 24.3241 34.0271 9.5131 20.7716 31.0606 10.4456 43.9621 6.4974 12.7539 57.5747 348.5246 869.1842 2.5954 19.1472 8.8597 23.9811 0.1625 12.9081 18.6084 22.8682 14.9627 7.8857 1.7357 6.5793 0.1778
temp: 298.150 k
press: 1.00000 atm
elementType: 17 7 7 7 6 6 6 6 6 6 6 6 6 6 1 1 1 1 1 1 1 1 1 1 1 1 1
symmnumber: 1
zpe: 566592.6 jmol-1
zpe.correction: 0.215804 hartree
zpe.thermalcorrener: 0.230056 hartree
zpe.thermalcorrenthalpy: 0.231000 hartree
zpe.thermalcorrgfe: 0.174537 hartree
zpe.sumelectzpe: -1011.844300 hartree
zpe.sumelectthermal: -1011.830047 hartree
zpe.sumelectthermalent: -1011.829103 hartree
zpe.sumelectthermalfe: -1011.885566 hartree
dipole: 1.1951 -3.0493 -1.0244
dipole: 3.4316
quadrupole: -44.9453 -71.0784 -87.3932
quadrupole: 1.3103 2.5044 0.3124
quadrupole: 22.8603 -3.2728 -19.5876 1.3103 2.5044 0.3124
hfenergy: -1012.0601035 hartree
pointgroup: C01 [X(C10H13Cl1N3)]
dipole: 0.3081741 -0.0701973 -1.3125877 debye
polarizability: 288.0629489|-0.9943971|79.9427434|-19.085027|17.7022984|129.9133745 unknown
InChI: InChI=1S/C10H13ClN3/c1-3-14(4-2)10-6-5-8(13-12)7-9(10)11/h5-7H,3-4H2,1-2H3
charge 1 multiplicity 1
27 atoms
Cl -0.246117 0.455332 2.778058
N  -1.850657 0.077226 -0.073154
N  3.738021 -0.143802 -0.35278
N  4.903992 -0.143882 -0.441236
C  -2.663402 0.922881 0.864106
C  -2.661341 -0.548539 -1.173794
C  -0.488335 -0.045213 -0.055191
C  -3.578887 0.11183 1.799795
C  -2.667706 -2.089894 -1.126575
C  0.380508 0.228065 1.088085
C  0.202645 -0.482066 -1.261936
C  1.764356 0.201369 0.991452
C  1.579433 -0.51333 -1.384024
C  2.384023 -0.141116 -0.255518
H  -1.998108 1.581027 1.43766
H  -3.275562 1.576535 0.212849
H  -3.690387 -0.176475 -1.049341
H  -2.314746 -0.171685 -2.154497
H  -4.289825 -0.520192 1.239307
H  -2.994026 -0.530652 2.47791
H  -4.171349 0.811685 2.414292
H  -1.662479 -2.525904 -1.256612
H  -3.075476 -2.451771 -0.167855
H  -3.309855 -2.4750 -1.937852
H  -0.386248 -0.750254 -2.139082
H  2.375644 0.400694 1.876116
H  2.048083 -0.801069 -2.329284
