program: Gaussian 09
title: 000084547
version: EM64L-G09RevD.01
frameworkgroup: C1[X(C8H11N2O)]
method: RPBEPBE
basis: SDD
operation: Freq
keyword: #p
keyword: freq=noraman
keyword: PBEPBE/SDD
title: #p freq=noraman PBEPBE/SDD
converged: YES YES NO NO
title: Mulliken charges:
elementType: O N N C C C C C C C C H H H H H H H H H H H
charge: -0.237305 -0.052434 -0.617558 -0.348674 -0.237693 0.261039 -0.135382 -0.626995 -0.216128 -0.170339 0.211827 0.263050 0.251477 0.340980 0.295363 0.238277 0.270194 0.247382 0.264038 0.283014 0.335971 0.379897
chargesum: 1.00000
title: Mulliken charges with hydrogens summed into heavy atoms:
elementType: O N N C C C C C C C C
charge: -0.237305 -0.052434 0.098310 0.165853 0.103288 0.261039 0.159981 0.128857 0.047910 0.112675 0.211827
polarizability: 1.33941856e+02 -1.56698700e+00 1.09354008e+02 -4.16270557e+00 4.52077034e+00 5.18820086e+01
1716.lowfreq: -1.8255 0.0005 0.0007 0.0008 7.2841 10.0289 24.7735 43.5906 120.3223
frequency: 24.6784 43.5244 120.3140 157.3970 175.9059 237.8150 301.9266 342.8771 390.6791 407.5997 453.8971 480.0569 514.3843 565.2878 592.5859 659.3626 691.9772 703.7579 731.1437 796.1782 827.1534 848.0914 941.6453 969.7715 981.3960 1002.3775 1017.0559 1054.6339 1082.5666 1092.2473 1122.1448 1144.0068 1174.1141 1206.5678 1247.1290 1313.3300 1334.3757 1363.5882 1377.4368 1406.8102 1439.0730 1470.4365 1472.4833 1479.0788 1498.1632 1572.3170 1586.2824 1625.7080 1658.8623 3002.9972 3042.9394 3094.2465 3108.9654 3119.0207 3167.2452 3172.3985 3190.2730 3207.3065 3517.4175 3662.9077
redmass: 4.7037 2.6251 3.5278 3.9940 2.8809 1.1951 3.1407 3.1802 4.0071 2.5791 1.8261 3.0865 2.4231 3.1878 3.9693 1.4539 2.1999 4.8409 3.0701 1.1444 1.5799 3.8470 1.4527 1.3877 2.3451 1.3922 5.6815 1.8382 2.0723 1.8667 1.8909 1.5905 3.4934 1.1313 1.2563 1.3383 1.2541 3.7102 5.1371 1.1887 1.9533 1.0435 1.3115 1.6024 1.2158 4.1390 3.1890 3.0381 2.2491 1.0366 1.0605 1.1039 1.0995 1.1059 1.0920 1.0955 1.0928 1.1014 1.0472 1.1032
irintensity: 15.2281 0.4077 0.3163 0.8206 10.8050 2.1863 0.7296 0.8582 6.7101 0.5615 29.1189 10.9275 23.7418 13.7116 16.1844 159.7950 12.5072 2.3535 131.6262 3.5009 31.4590 0.2214 1.7961 11.3891 3.6343 0.1073 2.4952 2.7237 2.3679 13.0647 22.6707 13.3253 53.2836 3.4404 0.9927 2.2080 0.3730 132.0663 40.3068 12.7158 10.0895 22.9190 13.5816 20.9789 19.9689 13.1779 38.1058 3.7794 300.9879 3.1877 7.6397 2.1725 8.8649 10.9280 2.1588 18.1513 1.1089 2.0483 107.8811 49.6999
temp: 298.150 k
press: 1.00000 atm
elementType: 8 7 7 6 6 6 6 6 6 6 6 1 1 1 1 1 1 1 1 1 1 1
symmnumber: 1
zpe: 478422.0 jmol-1
zpe.correction: 0.182221 hartree
zpe.thermalcorrener: 0.192818 hartree
zpe.thermalcorrenthalpy: 0.193763 hartree
zpe.thermalcorrgfe: 0.144752 hartree
zpe.sumelectzpe: -495.141697 hartree
zpe.sumelectthermal: -495.131100 hartree
zpe.sumelectthermalent: -495.130156 hartree
zpe.sumelectthermalfe: -495.179166 hartree
dipole: 2.5002 4.9865 -0.3879
dipole: 5.5917
quadrupole: -21.8022 -52.2450 -64.0204
quadrupole: -9.9170 -2.6661 1.7471
quadrupole: 24.2203 -6.2225 -17.9979 -9.9170 -2.6661 1.7471
hfenergy: -495.3239182 hartree
pointgroup: C01 [X(C8H11N2O1)]
dipole: -0.82855 -1.9376391 -0.6314729 debye
dipolederiv: -0.7328497 -0.092824 0.0041608 0.1737187 -0.7638914 -0.1216208 0.0744797 -0.0934084 -0.3675513 -0.3126888 0.1006741 0.041721 0.131079 -0.103093 -0.0156496 0.0040826 -0.0014011 -0.1048115 -1.1559728 0.2300458 0.0925054 0.1417091 -0.3822264 0.0845978 0.05412 0.0929576 -0.6273705 0.5415503 -0.1468911 -0.0651318 -0.2069287 0.2356729 0.0340515 0.0502584 -0.0223408 0.1988317 0.1005695 -0.2372119 -0.0351229 0.0841382 0.0654744 -0.0100092 0.002181 -0.0016997 0.0271538 -0.0528046 0.2172509 0.035012 -0.0351202 -0.2337724 -0.0556489 -0.0363762 -0.056042 0.0497926 0.1759255 0.1189697 0.0331431 -0.2483449 0.0509883 0.0083843 -0.0228042 0.0163215 -0.009506 -0.0851537 0.0605987 0.0223703 0.0857594 0.0275047 -0.0104228 -0.0512576 0.0213471 -0.0127229 0.1876914 -0.0635674 0.005078 -0.0426916 0.1104851 0.0073597 0.0182695 0.0251726 -0.0285793 -0.3483996 -0.133205 -0.0179848 0.0318128 0.1581744 0.0317522 0.0095581 0.0358807 -0.060771 1.5701127 -0.0557608 -0.0905368 -0.1855793 0.9183527 0.1959951 -0.1070145 0.1593056 0.3061769 0.0191299 -0.0553654 0.0722822 -0.0033441 0.0037667 0.0695917 0.0300911 0.0416459 0.0587902 0.0256185 0.0106318 -0.0200792 -0.0331352 0.0164247 -0.1162483 -0.0305978 -0.0568012 0.0183375 0.1995129 0.0298885 -0.0030872 0.0694502 0.1486828 0.0008613 0.0179484 -0.0022078 0.1588674 0.058667 -0.015992 -0.0108308 0.0069595 0.1358858 0.0035085 -0.0060949 -0.0016624 0.1699526 0.1309773 0.0000967 0.007987 -0.0206462 -0.0848405 0.0719401 0.0059569 0.0196588 0.0473621 -0.0263577 0.0837062 -0.0011754 0.0835867 0.0920433 0.0080565 0.0303584 -0.0036378 0.0867743 0.0050836 -0.0904466 -0.0760424 -0.084525 0.0700164 -0.0447887 -0.0383044 -0.0197814 0.031274 0.0004829 0.0490935 0.0036511 0.0355525 0.1231468 -0.0006043 -0.0098078 -0.0137461 0.1470143 0.099332 -0.0103491 -0.0039029 -0.0125039 0.0510185 -0.0168399 -0.0060164 -0.015129 0.1659916 0.2925478 -0.0154732 -0.0029332 -0.0355946 0.1539928 -0.0674283 -0.0092086 -0.0737729 0.3674484 0.3070257 0.0161307 0.0089165 0.0646476 0.2061932 -0.0568378 0.0201782 -0.0506591 0.377545 unknown
polarizability: 134.1810326|0.8818568|107.1801646|-2.724228|11.5354801|53.8166753 unknown
InChI: InChI=1S/C8H11N2O/c1-2-10-5-3-4-7(6-10)8(9)11/h3-6H,2,9H2,1H3
charge 1 multiplicity 1
22 atoms
O  1.767916 2.436127 0.367479
N  -1.596006 0.197315 -0.286465
N  3.261046 0.727294 -0.136134
C  -2.929634 0.907673 -0.198674
C  -0.441936 0.915954 -0.132994
C  0.820423 0.290077 -0.163737
C  -1.559147 -1.16861 -0.461784
C  -3.425302 0.995774 1.255452
C  0.872381 -1.112726 -0.346105
C  -0.331562 -1.842007 -0.492887
C  1.998831 1.234102 0.042037
H  -2.793224 1.909713 -0.637803
H  -3.63829 0.351253 -0.83451
H  -0.506372 1.997002 0.024467
H  -2.518247 -1.678497 -0.573194
H  -3.576246 -0.003171 1.699464
H  -4.395228 1.521407 1.268434
H  -2.725742 1.564354 1.891787
H  1.822586 -1.655118 -0.364492
H  -0.324082 -2.925355 -0.631633
H  3.465505 -0.221365 -0.444854
H  4.049131 1.360803 0.012647
