program: Gaussian 09
title: 000082078
version: EM64L-G09RevD.01
frameworkgroup: C1[X(C10H12O4S)]
method: RPBEPBE
basis: SDD
operation: Freq
keyword: #p
keyword: freq=noraman
keyword: PBEPBE/SDD
title: #p freq=noraman PBEPBE/SDD
converged: YES YES NO NO
title: Mulliken charges:
elementType: S O O O O C C C C C C C C C C H H H H H H H H H H H H
charge: 0.906409 -0.267652 -0.537319 -0.527482 -0.214661 -0.701200 -0.064020 -0.207955 -0.270106 0.357319 -0.208396 -0.205009 -0.215809 -0.254829 -0.660852 0.288671 0.316945 0.277876 0.294343 0.241758 0.243724 0.238836 0.246819 0.220131 0.222962 0.226167 0.253331
chargesum: 0.00000
title: Mulliken charges with hydrogens summed into heavy atoms:
elementType: S O O O O C C C C C C C C C C
charge: 0.906409 -0.267652 -0.537319 -0.527482 -0.214661 -0.095585 -0.064020 0.069921 0.024237 0.357319 0.033361 0.038715 0.023027 0.212121 0.041607
polarizability: 1.76957799e+02 1.01177679e+01 1.53745677e+02 -1.55404757e+01 1.24843518e+01 1.05262613e+02
1716.lowfreq: -13.6270 -10.9296 -3.9081 0.0008 0.0011 0.0011 8.8544 26.5655 38.5870
frequency: 8.6734 26.3373 38.2650 59.6443 77.9315 90.5841 130.3584 144.9853 190.0093 201.2052 217.4155 244.0478 283.9584 302.5015 336.3283 379.2715 402.4437 415.0251 431.4041 451.7472 519.8079 601.9401 624.1134 654.1550 689.1644 701.4957 743.9662 761.2225 787.3057 809.4192 849.7656 896.1133 904.6716 933.7670 935.2438 977.4180 983.4538 1005.4807 1008.2942 1017.5751 1046.0221 1075.0873 1078.0980 1096.1378 1157.8427 1173.0315 1177.2176 1192.0759 1206.5521 1278.0038 1302.6311 1355.0196 1383.2912 1390.3234 1395.9916 1435.8977 1451.7652 1457.2677 1464.5710 1485.2537 1577.0089 1603.5996 1636.8994 2994.9345 3034.8419 3071.1689 3090.3294 3097.6730 3123.4638 3137.4606 3147.6981 3157.3381 3167.5994 3176.5785 3178.5024
redmass: 4.4476 3.7279 4.7720 3.7287 5.7291 4.2497 5.7105 6.9757 4.6525 7.9854 1.3268 8.6026 2.1466 4.4196 6.0175 6.0450 2.8088 7.9022 3.2228 4.1216 5.8018 6.4738 4.2540 6.7108 2.3532 5.7015 2.7375 1.4752 7.1076 1.3571 1.2477 2.0658 3.0670 6.2969 1.5583 5.2006 1.4471 1.3500 4.1438 3.1071 2.0928 1.4778 1.4198 2.1173 1.6580 1.0582 1.1281 1.2498 2.9199 1.1216 1.3018 1.2760 8.2492 1.2281 1.1335 2.2575 2.0215 1.0923 1.0441 1.0521 5.7970 6.9445 9.4773 1.0361 1.0593 1.0558 1.0977 1.1033 1.1066 1.0858 1.0888 1.0933 1.0968 1.1006 1.1119
irintensity: 0.4743 0.1487 0.6012 1.9731 0.7827 1.7887 2.2371 0.5908 6.0854 0.6604 2.8548 6.7524 4.4080 6.5103 5.3961 22.4334 0.0552 45.5386 3.9921 11.9076 101.5569 0.0452 2.7237 4.8931 33.4103 6.0931 11.5877 74.5498 59.7054 10.4519 0.7480 25.5389 16.3186 61.3919 8.2128 1.2871 0.1405 0.0893 1.7267 74.1131 20.3501 61.5445 37.0451 11.2348 7.7665 0.3891 8.8139 17.2661 241.7805 7.8870 2.9065 2.0127 5.2181 25.0649 19.5148 15.7628 14.1960 12.7948 15.4527 13.4776 2.9127 0.2539 213.5252 18.5472 19.4880 2.5893 29.1155 1.3704 24.5923 1.1882 9.7475 2.6067 8.2699 22.0505 0.8250
temp: 298.150 k
press: 1.00000 atm
elementType: 16 8 8 8 8 6 6 6 6 6 6 6 6 6 6 1 1 1 1 1 1 1 1 1 1 1 1
symmnumber: 1
zpe: 530147.2 jmol-1
zpe.correction: 0.201922 hartree
zpe.thermalcorrener: 0.217944 hartree
zpe.thermalcorrenthalpy: 0.218888 hartree
zpe.thermalcorrgfe: 0.155020 hartree
zpe.sumelectzpe: -1085.924959 hartree
zpe.sumelectthermal: -1085.908937 hartree
zpe.sumelectthermalent: -1085.907993 hartree
zpe.sumelectthermalfe: -1085.971862 hartree
dipole: 1.3361 6.7995 -2.9677
dipole: 7.5383
quadrupole: -87.0971 -99.8684 -97.2101
quadrupole: -0.5314 -3.6186 8.6674
quadrupole: 7.6281 -5.1432 -2.4849 -0.5314 -3.6186 8.6674
hfenergy: -1086.1268814 hartree
pointgroup: C01 [X(C10H12O4S1)]
dipole: 0.5806544 2.8470933 0.5939509 debye
polarizability: 177.6863811|16.0696|125.1353633|-6.105212|27.2189805|133.1443445 unknown
InChI: InChI=1S/C10H12O4S/c1-2-14-10(11)8-15(12,13)9-6-4-3-5-7-9/h3-7H,2,8H2,1H3
charge 0 multiplicity 1
27 atoms
S  0.199293 -1.544073 -0.796428
O  -2.125454 0.631418 0.082787
O  0.971878 -2.401102 -1.955238
O  -0.509348 -2.254406 0.490367
O  -3.502702 -0.869166 -1.07281
C  -1.188947 -0.500546 -1.783934
C  1.425791 -0.249069 -0.151944
C  1.175628 0.339855 1.097401
C  2.562218 0.010493 -0.934635
C  -2.404118 -0.290954 -0.924101
C  2.125735 1.269224 1.580705
C  3.499723 0.943559 -0.432598
C  3.277859 1.571479 0.816116
C  -3.230182 0.892675 1.06332
C  -4.194632 1.952135 0.524794
H  -0.668272 0.431612 -2.045998
H  -1.392577 -1.147932 -2.647774
H  0.283911 0.067562 1.669735
H  2.716128 -0.520681 -1.880032
H  1.968265 1.749433 2.552013
H  4.401397 1.170014 -1.01095
H  4.010772 2.289574 1.199633
H  -3.744411 -0.063034 1.264156
H  -2.695874 1.234209 1.963991
H  -4.94994 2.188653 1.296859
H  -3.658806 2.882744 0.270195
H  -4.722934 1.583124 -0.36973
