program: Gaussian 09
title: 000081894
version: EM64L-G09RevD.01
frameworkgroup: C1[X(C13H18O2)]
method: RPBEPBE
basis: SDD
operation: Freq
keyword: #pfreq=noraman
keyword: PBEPBE/SDD
title: #p freq=noraman PBEPBE/SDD
converged: YES YES NO NO
title: Mulliken charges:
elementType: O O C C C C C C C C C C C C C H H H H H H H H H H H H H H H H H H
charge: -0.260293 -0.244863 -0.383062 -0.556801 -0.302146 0.500731 -0.487028 -0.349902 -0.417238 -0.403222 0.253389 -0.682213 -0.225625 -0.228096 -0.242950 0.224713 0.244978 0.212587 0.202609 0.222503 0.228799 0.232213 0.240750 0.209002 0.228620 0.230638 0.235656 0.222736 0.208629 0.209622 0.223500 0.224284 0.227479
chargesum: 0.00000
title: Mulliken charges with hydrogens summed into heavy atoms:
elementType: O O C C C C C C C C C C C C C
charge: -0.260293 -0.244863 0.086629 -0.141605 0.149157 0.500731 -0.014065 0.087720 -0.186600 -0.167566 0.253389 -0.041225 -0.002125 -0.003812 -0.015471
polarizability: 1.78023831e+02 8.70699008e+00 1.31294593e+02 -1.42129971e+01 1.27486242e+01 1.19934260e+02
1716.lowfreq: -13.2561 -6.7121 0.0007 0.0008 0.0010 4.0755 9.5169 21.4239 35.7345
frequency: -7.4268 14.6967 35.6401 38.7466 54.3677 76.1974 100.1318 110.9411 158.9483 224.7514 233.4036 236.0621 297.9324 323.1539 336.5268 367.3660 402.6419 460.8453 527.4979 560.9746 580.6549 618.7329 664.4152 704.7173 738.8880 760.1013 768.5170 800.8596 829.8810 852.9153 863.6752 872.9940 893.7269 916.4892 960.6596 975.5252 989.9006 993.3279 1024.0056 1029.7831 1046.3063 1056.4907 1065.0182 1089.2237 1104.7970 1109.9106 1141.1643 1171.8970 1187.0762 1187.4959 1217.6431 1222.4404 1261.9108 1274.2857 1277.7955 1289.5196 1299.9100 1327.5618 1335.2441 1355.5187 1372.6326 1383.7068 1392.5951 1441.6909 1443.1250 1454.1739 1472.9999 1474.0499 1478.8118 1484.9865 1486.3394 1488.2339 1594.3996 1615.0798 1641.6173 2973.7105 2977.1831 2979.6462 2999.9589 3002.8843 3018.0537 3027.9857 3040.4625 3058.9109 3063.8036 3076.7108 3079.6377 3098.6408 3113.9799 3115.3126 3131.3344 3143.1568 3161.9627
redmass: 2.5204 3.7131 5.8144 2.7037 3.4410 3.1218 2.4231 3.2107 3.3648 3.9948 1.0901 4.3070 3.3441 3.6052 2.3876 3.4936 2.8154 4.4325 3.4845 3.2087 4.2838 6.3555 3.9889 1.7490 1.1796 1.9025 1.1313 4.0842 2.8431 1.2702 1.3959 1.5527 2.0685 1.4517 4.3380 1.3880 6.2881 1.3169 3.2527 2.5769 1.5879 2.3754 3.5428 1.9061 1.4296 2.3545 2.6473 1.0537 1.1176 1.3619 2.4186 1.3317 1.3083 1.2411 1.2055 1.0881 1.3144 1.2627 1.3987 1.5509 1.4151 7.7152 1.2153 2.1840 1.0870 1.0932 1.1134 1.0526 1.0443 2.2507 1.0769 1.0997 6.0680 6.2066 9.1544 1.0362 1.0589 1.0652 1.0616 1.0599 1.0575 1.1013 1.0966 1.0973 1.1039 1.0992 1.1012 1.1082 1.0871 1.0871 1.0907 1.0958 1.1015
irintensity: 0.0121 0.0504 0.8460 1.3091 0.1910 0.4787 0.5652 0.2715 2.3624 0.0811 0.0743 4.8458 19.0392 1.5505 0.3278 7.2724 0.0023 4.4687 15.2272 5.6082 1.9200 0.0740 7.2493 52.5702 12.8455 44.3579 4.5399 6.6683 3.2720 0.1785 1.5955 0.3487 3.3922 4.6522 84.2338 0.0247 0.0635 0.2038 4.6211 8.9659 7.8667 5.8667 9.0808 96.4113 4.3325 24.1631 242.8534 0.0269 0.2009 11.9625 0.0532 4.3217 8.9597 0.7673 26.1332 0.0946 42.3104 0.2698 0.7523 25.1229 5.1834 0.0629 7.8366 6.5302 21.7412 8.6513 0.5823 4.9046 12.9635 19.7551 15.9652 15.6839 1.5214 10.7748 142.4849 36.7914 27.8937 5.4287 25.9716 7.7100 54.7484 10.0662 1.1539 2.0055 9.5072 49.5210 74.1771 27.1265 9.4675 7.7166 10.5304 44.9725 23.5374
temp: 298.150 k
press: 1.00000 atm
elementType: 8 8 6 6 6 6 6 6 6 6 6 6 6 6 6 1 1 1 1 1 1 1 1 1 1 1 1 1 1 1 1 1 1
symmnumber: 1
zpe: 733966.3 jmol-1
zpe.correction: 0.279553 hartree
zpe.thermalcorrener: 0.294671 hartree
zpe.thermalcorrenthalpy: 0.295615 hartree
zpe.thermalcorrgfe: 0.233979 hartree
zpe.sumelectzpe: -655.495683 hartree
zpe.sumelectthermal: -655.480566 hartree
zpe.sumelectthermalent: -655.479621 hartree
zpe.sumelectthermalfe: -655.541257 hartree
dipole: 0.0650 -0.7712 -1.2980
dipole: 1.5112
quadrupole: -84.5659 -85.9875 -92.4131
quadrupole: 1.3804 1.1658 -0.2397
quadrupole: 3.0896 1.6679 -4.7576 1.3804 1.1658 -0.2397
hfenergy: -655.775236 hartree
pointgroup: C01 [X(C13H18O2)]
dipole: -0.0250952 0.1383448 0.5776881 debye
polarizability: 178.465077|-15.1799574|112.5458266|-4.1999725|-6.0166268|138.24178 unknown
InChI: InChI=1S/C13H18O2/c1-2-7-13(14)15-11-6-10-12-8-4-3-5-9-12/h3-5,8-9H,2,6-7,10-11H2,1H3
charge 0 multiplicity 1
33 atoms
O  2.212627 -0.574737 1.102294
O  2.66105 -0.652576 -1.187932
C  -0.217449 -0.490089 0.543872
C  -1.518362 -1.325047 0.375172
C  0.979876 -1.388585 0.881574
C  -2.721751 -0.44982 0.053622
C  4.131571 0.642605 0.328748
C  5.301016 0.549021 -0.675689
C  -3.56988 0.028843 1.085078
C  -2.997531 -0.060848 -1.282979
C  2.95904 -0.25069 -0.039248
C  6.41807 1.56332 -0.354963
C  -4.663881 0.874638 0.791799
C  -4.089941 0.784114 -1.581691
C  -4.927672 1.255803 -0.544107
H  -0.358024 0.258345 1.346308
H  -0.011112 0.061955 -0.391296
H  -1.362362 -2.067389 -0.43241
H  -1.704475 -1.895306 1.306743
H  0.836659 -1.916885 1.839163
H  1.173439 -2.113631 0.069686
H  3.75285 1.685498 0.361482
H  4.455909 0.401762 1.356901
H  5.710452 -0.479383 -0.664962
H  4.911083 0.715352 -1.69655
H  -3.37425 -0.267557 2.123538
H  -2.354415 -0.42639 -2.093643
H  7.249772 1.478415 -1.077457
H  6.03855 2.601837 -0.398925
H  6.833583 1.399939 0.657413
H  -5.310886 1.231719 1.601314
H  -4.290108 1.070989 -2.620419
H  -5.777046 1.908775 -0.774337
