program: Gaussian 09
title: 000081952
version: EM64L-G09RevD.01
frameworkgroup: C1[X(C8H8N4O6)]
method: RPBEPBE
basis: SDD
operation: Freq
keyword: #pfreq=noraman
keyword: PBEPBE/SDD
title: #p freq=noraman PBEPBE/SDD
converged: YES YES NO NO
title: Mulliken charges:
elementType: O O O O O O N N N N C C C C C C C C H H H H H H H H
charge: -0.177493 -0.172511 -0.198395 -0.246469 -0.193849 -0.192649 -0.344803 -0.001866 0.025282 0.015729 0.217465 0.357593 0.302904 -0.347145 0.493720 -0.541491 -0.555561 -0.706190 0.361044 0.286788 0.236245 0.334650 0.343731 0.232575 0.229257 0.241440
chargesum: 0.00000
title: Mulliken charges with hydrogens summed into heavy atoms:
elementType: O O O O O O N N N N C C C C C C C C
charge: -0.177493 -0.172511 -0.198395 -0.246469 -0.193849 -0.192649 0.016240 -0.001866 0.025282 0.015729 0.217465 0.357593 0.302904 0.175887 0.493720 -0.206840 -0.211830 -0.002918
polarizability: 2.33017787e+02 1.60052827e-01 1.95725273e+02 7.83864852e+00 5.94114598e+00 7.07785561e+01
1716.lowfreq: -4.3249 -0.0009 -0.0003 0.0002 1.4251 5.7953 34.1460 58.8498 61.5264
frequency: 34.1408 58.8485 61.5256 78.0881 99.1987 118.9429 134.2075 157.8382 166.3509 196.4509 204.8938 248.3468 286.2054 298.9811 321.0264 331.3081 366.8534 378.6702 392.7041 452.3052 510.4357 525.0392 548.3709 630.2349 643.7592 675.2690 678.9601 701.2510 704.6385 739.3398 748.9222 787.9198 816.8988 850.1292 873.9981 898.4742 938.6043 966.6495 979.5863 1058.4299 1078.7427 1113.9628 1129.6489 1135.5711 1162.2668 1181.3415 1196.4258 1225.1613 1268.5019 1309.1982 1340.3166 1343.1444 1359.9873 1368.5135 1379.3831 1403.1026 1441.8647 1468.3042 1476.0855 1479.8513 1501.3763 1539.1388 1585.6487 1619.1075 2990.2906 2993.9058 3040.0008 3091.6765 3102.9445 3181.1217 3184.8983 3229.6107
redmass: 6.5474 11.5705 11.1171 5.9529 7.7111 2.5361 8.5282 2.7013 4.0416 4.9695 9.4680 1.6724 4.5098 7.6784 12.0511 6.6104 4.3708 9.0479 9.1081 5.4361 6.0908 6.1062 5.5296 8.7495 7.6327 10.7455 9.3697 6.5287 7.9198 13.8149 7.7761 3.0741 1.3087 1.2767 6.0599 5.6701 2.2560 1.4840 1.3939 3.0387 1.7916 2.1765 1.8013 4.8296 9.3662 2.3175 5.2811 7.1242 1.1530 2.4625 2.5933 3.5786 2.4142 7.3429 7.8713 1.2206 7.5418 1.1026 1.0617 1.0911 2.7464 3.8492 2.9291 8.2981 1.0589 1.0366 1.1033 1.1008 1.0996 1.0925 1.0921 1.0787
irintensity: 1.1428 0.0812 0.1042 1.1468 6.8375 1.0925 2.0384 3.0945 1.4393 1.3685 4.2725 2.4105 2.6914 1.1786 0.6851 0.2563 3.5194 0.7201 4.1710 2.9182 5.2143 2.7292 1.1787 9.4907 13.0076 24.4205 15.3595 12.3063 8.8685 5.1932 4.8263 4.0710 9.8573 75.9756 22.0460 18.3268 6.3972 18.7676 17.2362 16.8733 45.7615 19.1858 9.0582 53.3850 415.4004 28.0672 390.9364 198.3180 10.3225 61.3755 25.7968 186.1299 85.6446 55.2712 43.3450 22.9481 7.4549 34.5600 13.7424 7.2958 42.2787 56.5184 153.1418 311.3161 16.7098 20.9188 2.1498 26.2681 19.9509 20.0327 22.4622 141.9949
temp: 298.150 k
press: 1.00000 atm
elementType: 8 8 8 8 8 8 7 7 7 7 6 6 6 6 6 6 6 6 1 1 1 1 1 1 1 1
symmnumber: 1
zpe: 458079.4 jmol-1
zpe.correction: 0.174473 hartree
zpe.thermalcorrener: 0.190751 hartree
zpe.thermalcorrenthalpy: 0.191696 hartree
zpe.thermalcorrgfe: 0.129628 hartree
zpe.sumelectzpe: -978.425456 hartree
zpe.sumelectthermal: -978.409178 hartree
zpe.sumelectthermalent: -978.408234 hartree
zpe.sumelectthermalfe: -978.470302 hartree
dipole: 5.3524 0.2864 -1.2644
dipole: 5.5072
quadrupole: -111.6442 -129.6716 -102.4496
quadrupole: 0.2130 -7.4729 -0.1354
quadrupole: 2.9443 -15.0832 12.1389 0.2130 -7.4729 -0.1354
hfenergy: -978.5999295 hartree
pointgroup: C01 [X(C8H8N4O6)]
dipole: 2.1534523 -0.0925171 -0.2204223 debye
dipolederiv: -0.2287823 -0.1100661 -0.0900499 -0.0198568 -0.9311491 -0.040193 -0.1273014 -0.0663685 -0.3446238 -0.4267315 0.3307744 -0.0471315 0.1398098 -0.9676208 0.0742073 -0.0566798 0.1426963 -0.2159746 -0.4499379 0.1788683 -0.3099676 0.1082934 -0.4733736 0.0270217 -0.2728954 0.0655346 -0.5798309 -0.7939449 -0.2911594 -0.0460863 -0.0776143 -0.5118592 0.0036573 -0.0697153 -0.0209229 -0.2545728 -0.7442342 -0.2112543 -0.0840413 -0.3591723 -0.6286377 -0.0170649 -0.077722 -0.0002841 -0.2342971 -0.8216807 0.1550188 -0.1453943 0.3157552 -0.5340672 0.0979577 -0.1659483 0.0685028 -0.2585916 -1.3734413 0.1409314 -0.0351955 -0.1623549 -0.3685708 0.0274205 -0.000228 -0.0139373 -0.3120767 0.4229217 -0.2239513 0.5287915 -0.2427387 1.629089 -0.1331828 0.4854584 -0.1281679 0.7790309 0.9700388 0.2776486 0.0794206 0.2100377 1.9654511 -0.1114405 0.1440806 -0.1399412 0.2113297 2.1295121 0.1378218 0.3820465 0.1248036 0.9130842 -0.0577408 0.4217251 -0.0381165 0.2639039 1.3154308 -0.1111303 0.0153324 0.2767441 0.1612464 -0.0379815 -0.0281374 0.0564006 0.1055545 -0.5691033 0.5175405 -0.221205 -0.3013146 -0.276483 0.0469881 -0.1171832 0.1648784 -0.1174745 -0.659553 -0.6467103 0.0095822 0.1210715 -0.7492746 0.0625322 -0.0451153 -0.032533 0.0145948 0.5618844 -0.1893397 -0.0011193 -0.2816616 0.3205852 -0.0027573 -0.1446157 -0.0030081 0.2389519 -0.951997 -0.0603073 -0.1732142 -0.0885823 -0.8050275 0.1077609 -0.2209014 0.1099536 -0.0158279 0.5385783 -0.5900742 0.1739906 -0.2568249 0.2185301 -0.0591334 0.1820087 -0.2661494 0.0571403 0.4561058 0.7329637 -0.0308744 0.3410433 0.3745979 0.0038371 0.0282778 0.0883475 -0.0410907 -0.0656772 0.003445 0.0424424 0.0763757 0.0251522 0.0137035 0.0713478 0.0274949 0.068745 0.2670865 0.0001414 0.0029455 -0.0039967 0.359906 -0.0004169 -0.0141822 -0.0067828 0.2850635 0.0234883 -0.0055361 0.0415444 0.0880004 0.0109343 0.050964 0.0352339 0.0892361 -0.0323138 -0.060602 -0.0982606 -0.0505387 0.0078243 -0.0468394 -0.0580226 0.0112819 -0.0659606 0.0194054 0.1649425 -0.0062038 0.0108226 0.0117941 0.1374101 0.0095195 -0.0016217 0.0023602 0.165565 0.1764027 -0.0017342 -0.0000115 0.0007892 0.1550865 0.0021659 -0.0157427 -0.008705 0.1744302 0.0784777 0.0085159 -0.0606434 -0.0541792 0.064446 0.0788782 -0.0005616 0.0705452 -0.0981952 0.098631 -0.0272421 -0.0072196 -0.1055967 -0.0337014 -0.0909009 -0.0308837 -0.1043471 0.0065635 -0.0578155 0.0892999 0.0157737 0.1315507 -0.0089149 0.002221 0.0100212 0.0092744 0.1145911 unknown
polarizability: 228.2902537|1.2352742|194.2429815|28.1157482|-15.0130112|76.9883807 unknown
InChI: InChI=1S/C8H8N4O6/c1-2-9-8-6(11(15)16)3-5(10(13)14)4-7(8)12(17)18/h3-4,9H,2H2,1H3
charge 0 multiplicity 1
26 atoms
O  0.382859 -3.376817 0.574281
O  -0.286134 3.744377 -0.199953
O  1.538171 -2.045372 2.031763
O  1.805836 2.943672 0.185523
O  -3.938293 -1.312176 -0.478927
O  -4.084579 0.951799 -0.770745
N  2.186153 0.360701 0.346289
N  0.735936 -2.221897 1.02939
N  0.517164 2.764622 0.013166
N  -3.427638 -0.125636 -0.498068
C  0.834093 0.23618 0.31736
C  0.112437 -1.018746 0.439533
C  -0.020702 1.396092 0.0618
C  3.223708 -0.688241 0.293981
C  -1.990489 0.004461 -0.192236
C  -1.246533 -1.145767 0.137336
C  -1.395985 1.274989 -0.19127
C  4.525025 -0.097056 -0.273102
H  2.500899 1.350722 0.305548
H  3.385742 -1.107915 1.304501
H  2.868048 -1.521032 -0.342443
H  -1.736985 -2.121499 0.200325
H  -1.991075 2.167981 -0.401028
H  4.387851 0.279666 -1.30182
H  4.898909 0.730407 0.357053
H  5.303981 -0.877918 -0.294055
