program: Gaussian 09
title: 000079550
version: EM64L-G09RevD.01
frameworkgroup: C1[X(C8H14O2)]
method: RPBEPBE
basis: SDD
operation: Freq
keyword: #pfreq=noraman
keyword: PBEPBE/SDD
title: #p freq=noraman PBEPBE/SDD
converged: YES YES NO NO
title: Mulliken charges:
elementType: O O C C C C C C C C H H H H H H H H H H H H H H
charge: -0.269678 -0.250837 -0.174700 -0.473351 -0.474917 -0.420831 -0.418476 0.229758 -0.260340 -0.665674 0.251726 0.230000 0.230304 0.233419 0.229744 0.218211 0.210729 0.210581 0.218215 0.233480 0.221169 0.215696 0.225912 0.249859
chargesum: 0.00000
title: Mulliken charges with hydrogens summed into heavy atoms:
elementType: O O C C C C C C C C
charge: -0.269678 -0.250837 0.077027 -0.013047 -0.011754 0.008109 0.010320 0.229758 0.194310 0.025793
polarizability: 1.15548279e+02 -4.20527423e-01 7.88519131e+01 -1.75707306e+00 -1.66392837e-01 7.79747356e+01
1716.lowfreq: -3.2313 0.0003 0.0006 0.0008 4.5359 18.5160 19.6373 36.2418 64.3295
frequency: 18.8086 36.1186 64.2261 94.3815 112.6403 200.9991 209.2334 262.3041 309.9239 326.1583 437.6379 525.3998 618.0603 686.1367 700.9878 764.8995 798.4787 817.0152 818.3625 858.7216 891.3922 951.5246 958.0883 970.5010 978.8993 1020.8058 1072.0866 1074.0380 1094.8089 1111.8512 1155.8357 1173.0740 1175.9840 1209.6632 1222.5132 1268.0313 1279.4059 1287.3126 1297.5304 1303.6721 1305.0213 1343.5437 1363.9720 1389.3872 1456.2715 1461.8177 1465.7028 1474.6047 1475.7619 1485.0006 1492.9132 1634.3382 2992.1579 2995.1614 3001.7316 3003.3719 3015.7546 3027.8708 3034.5292 3045.1449 3066.2187 3071.7180 3086.8072 3087.9063 3091.8876 3117.8407
redmass: 2.2560 2.2392 2.7701 3.8898 2.5757 1.4504 2.7480 1.9985 5.1655 3.2692 3.1933 2.3607 2.7157 3.5482 8.7037 1.2391 1.9711 1.7962 1.5358 3.3824 2.6865 2.0075 2.7148 1.5026 1.3917 3.2285 2.5605 3.6741 2.2352 2.4444 1.6736 1.4013 1.4876 1.5089 1.1816 1.2687 1.1165 1.1887 1.2154 1.3827 1.4033 1.4003 1.4912 1.2355 1.0956 1.0444 1.0790 1.0844 1.0819 1.0511 1.0985 8.9023 1.0360 1.0584 1.0601 1.0613 1.0670 1.0595 1.0846 1.1012 1.1022 1.1050 1.0975 1.1045 1.1032 1.1058
irintensity: 0.6821 0.9230 1.0316 0.1864 1.0135 2.8819 2.6664 2.4012 4.3699 14.8508 3.5888 0.1305 0.2446 12.9393 5.9521 2.0657 7.0878 3.1182 1.7145 6.1908 17.4070 5.9464 4.4574 3.3673 0.4476 73.9761 8.7536 3.3921 65.0266 210.9202 12.8810 59.2901 2.8455 8.5249 2.0845 0.0488 2.4846 21.0075 0.1215 6.8005 22.9251 34.4300 30.3831 22.3919 14.5577 14.6535 2.0488 9.2711 16.3633 12.4863 0.8844 137.7430 20.5785 4.8955 40.5427 56.4556 40.0200 32.9558 4.8171 15.8245 5.1366 18.4139 36.9987 92.4670 0.9896 35.2630
temp: 298.150 k
press: 1.00000 atm
elementType: 8 8 6 6 6 6 6 6 6 6 1 1 1 1 1 1 1 1 1 1 1 1 1 1
symmnumber: 1
zpe: 545161.9 jmol-1
zpe.correction: 0.207641 hartree
zpe.thermalcorrener: 0.218701 hartree
zpe.thermalcorrenthalpy: 0.219646 hartree
zpe.thermalcorrgfe: 0.168595 hartree
zpe.sumelectzpe: -462.899016 hartree
zpe.sumelectthermal: -462.887956 hartree
zpe.sumelectthermalent: -462.887012 hartree
zpe.sumelectthermalfe: -462.938062 hartree
dipole: 0.1036 0.3474 -1.5000
dipole: 1.5432
quadrupole: -51.3875 -60.1863 -65.8529
quadrupole: -0.3231 -1.5303 1.0028
quadrupole: 7.7547 -1.0441 -6.7107 -0.3231 -1.5303 1.0028
hfenergy: -463.1066572 hartree
pointgroup: C01 [X(C8H14O2)]
dipole: 0.0384882 -0.4843591 -0.364033 debye
dipolederiv: -1.4695879 0.2742893 0.1891434 0.4187548 -0.6109215 -0.1382993 0.157793 -0.1099406 -0.3709487 -0.7295701 -0.1174953 -0.085996 0.1227395 -0.7379482 -0.2618503 0.0415388 -0.249562 -0.4746709 -0.4463489 -0.0161683 -0.0495493 0.0256596 0.0814516 0.0251168 -0.0510053 0.0259048 0.0176743 0.0174687 -0.0225284 -0.0072122 -0.1370055 0.0743012 -0.0207822 0.0683886 0.0755433 0.1080968 0.0435824 0.0002424 -0.0086222 -0.0220643 0.1263684 0.0347701 -0.1534793 -0.0507435 0.0444225 0.0355661 -0.0355648 0.0110163 0.041777 0.1129305 0.0946201 -0.0151111 0.0491265 0.0664828 0.0339341 -0.0106184 -0.0306479 0.0166532 0.1510622 0.0267058 0.0460531 0.0598896 0.0224628 1.7286883 -0.1609501 0.0013193 -0.5455445 0.949595 0.4733476 -0.1571179 0.4299768 0.4132934 0.8246558 -0.0465966 -0.0833661 0.1083038 0.2851914 -0.0414436 0.0451441 -0.0853981 0.2891737 -0.1012945 -0.0107018 0.0506731 -0.065026 -0.0345149 0.0801466 0.0242741 0.1145043 -0.039686 0.0693071 0.0080511 0.0061029 0.0133083 -0.0833887 -0.0620458 0.012705 -0.06343 0.0089095 0.018813 -0.0090599 0.0884818 0.0070328 0.0741245 0.0070018 0.0733192 0.0355108 -0.1507521 0.0470109 -0.0312093 -0.0151168 -0.0234954 -0.0934018 -0.0325982 -0.0131416 -0.0962239 0.0553139 0.0526624 -0.0264746 -0.0263726 -0.0089337 -0.049086 -0.1237821 -0.0122709 -0.0614094 0.0152682 0.040862 0.0364487 -0.0321517 0.0262898 -0.0644554 0.1430186 -0.0129967 0.1125899 -0.0357087 0.0295182 -0.0341214 -0.028514 -0.0803562 -0.0264474 -0.123373 -0.0705935 -0.0820157 -0.0926651 -0.076838 0.1090344 -0.0471892 0.1268113 -0.0763859 0.0549434 -0.0096008 0.0252587 0.0546374 -0.100572 0.0475592 0.1029184 0.0967992 0.0311486 -0.0658832 0.0943718 -0.0420959 -0.0278375 0.0146713 -0.0625016 -0.0108711 -0.1298696 -0.1488421 0.0064854 -0.0258267 -0.0229835 0.0437832 0.0054374 0.0049676 0.0458231 -0.0836465 0.0642541 -0.0741034 -0.0417821 -0.0247852 -0.0886998 -0.0506216 0.0603371 0.003412 0.0841543 -0.1075047 0.058329 0.0006409 0.0244901 0.0888322 -0.1883883 -0.0413921 -0.0294955 -0.0629607 0.1130686 0.009385 -0.0256066 -0.0032021 0.0819281 0.1199416 -0.0248973 -0.0310316 -0.0118917 0.033317 -0.0989179 0.014112 -0.0641284 -0.1080257 0.0811019 0.1093501 -0.012754 0.0825106 -0.0639164 0.0292086 0.0101919 0.0031235 0.0787159 unknown
polarizability: 115.5518455|-1.256862|77.9521539|-1.2357073|-0.1845208|78.8709287 unknown
InChI: InChI=1S/C8H14O2/c1-2-10-8(9)7-5-3-4-6-7/h7H,2-6H2,1H3
charge 0 multiplicity 1
24 atoms
O  1.7135 -0.974408 0.007369
O  1.009178 1.011394 1.013582
C  -0.650809 -0.513441 0.008483
C  -1.371884 0.501736 -0.92724
C  -1.625962 -0.590271 1.219815
C  -2.874719 0.11544 -0.821339
C  -3.042735 -0.576685 0.575197
C  0.737266 -0.051696 0.405308
C  3.133292 -0.620575 0.321695
C  3.730742 0.256194 -0.78272
H  -0.57074 -1.49815 -0.485249
H  -0.991454 0.467675 -1.963402
H  -1.199373 1.521433 -0.534552
H  -1.47055 0.30691 1.847446
H  -1.448978 -1.47989 1.849503
H  -3.14968 -0.58436 -1.631709
H  -3.523791 1.00274 -0.927421
H  -3.766445 -0.044447 1.217741
H  -3.420358 -1.60797 0.450145
H  3.158566 -0.106437 1.298736
H  3.635076 -1.599119 0.390859
H  4.803234 0.434885 -0.580105
H  3.642863 -0.236029 -1.766744
H  3.220761 1.23317 -0.823503
