program: Gaussian 09
title: 000084571
version: EM64L-G09RevD.01
frameworkgroup: C1[X(C12H22O11)]
method: RPBEPBE
basis: SDD
operation: Freq
keyword: #p
keyword: freq=noraman
keyword: PBEPBE/SDD
title: #p freq=noraman PBEPBE/SDD
converged: YES YES NO NO
title: Mulliken charges:
elementType: O O O O O O O O O O O C C C C C C C C C C C C H H H H H H H H H H H H H H H H H H H H H H
charge: -0.284204 -0.376959 -0.275012 -0.500169 -0.454929 -0.416814 -0.409220 -0.470444 -0.431161 -0.429209 -0.438104 -0.045532 -0.146185 0.014776 -0.104697 -0.185574 -0.092084 -0.129392 -0.159084 -0.054868 -0.064839 -0.346027 -0.376714 0.222780 0.241613 0.217777 0.276894 0.246185 0.198103 0.260742 0.231414 0.244958 0.241641 0.214227 0.192884 0.232244 0.218112 0.400689 0.367550 0.360524 0.336575 0.379201 0.376221 0.361005 0.355104
chargesum: 0.00000
title: Mulliken charges with hydrogens summed into heavy atoms:
elementType: O O O O O O O O O O O C C C C C C C C C C C C
charge: -0.284204 -0.376959 -0.275012 -0.099480 -0.087380 -0.056290 -0.072645 -0.091242 -0.054940 -0.068205 -0.083000 0.177248 0.095428 0.232553 0.172197 0.060611 0.106018 0.131350 0.085874 0.176545 0.176802 0.061084 0.073642
polarizability: 2.01451577e+02 2.66655059e-01 1.74257059e+02 -3.32288355e+00 -6.08610750e-01 1.27352598e+02
1716.lowfreq: -12.9598 -9.0066 -2.4743 -0.0008 -0.0008 -0.0006 21.2272 36.1535 45.3043
frequency: 20.9323 36.0995 45.1720 63.2384 74.6780 78.3020 94.0674 102.8773 128.0939 132.4651 150.9571 161.3346 169.4677 210.7103 216.7424 233.1886 240.2389 247.1488 260.4507 270.5922 311.1953 324.0870 343.1225 357.0311 358.9907 370.4489 377.9694 389.6154 398.0448 409.9652 419.2482 445.3122 448.6067 455.4733 457.0443 464.9664 472.9409 522.8741 541.9408 557.1960 585.0195 592.6432 622.0404 667.6589 696.8398 744.7214 746.8942 794.6175 829.9298 840.8790 873.2765 902.6713 905.4867 937.8834 961.3154 966.1602 986.1140 996.2767 1003.0599 1007.4774 1010.6412 1018.5298 1030.6722 1034.3406 1046.8648 1060.6339 1066.9464 1081.1415 1087.3220 1096.7319 1115.5466 1121.5106 1126.2909 1173.9264 1180.7604 1183.6571 1196.0407 1207.5050 1215.8933 1229.6051 1245.7968 1248.2085 1251.3251 1257.4448 1274.9874 1286.6807 1300.6335 1308.9409 1318.7604 1322.5784 1325.0820 1331.3848 1334.7012 1338.6619 1345.4186 1351.3302 1359.6139 1373.7303 1374.3109 1375.6076 1379.3474 1386.3367 1389.0198 1395.8658 1455.3493 1460.3293 1488.8281 2917.7796 2936.9152 2950.4911 2973.7213 2980.4160 2986.1247 2999.3012 3002.7007 3009.9033 3032.0752 3040.4518 3070.1964 3086.2669 3088.4239 3172.4257 3478.4854 3514.7651 3527.5179 3535.6382 3541.0484 3556.0483 3578.0868
redmass: 6.4315 6.1270 6.6397 6.7453 6.3277 4.2800 6.4006 7.2000 5.2613 5.8460 5.5864 3.4254 4.4049 4.6815 3.6813 5.3974 4.5390 4.4512 4.6335 2.6315 4.8148 5.9892 5.2613 2.6663 1.9680 3.5918 1.7706 1.2265 2.9248 2.0980 4.2396 1.1871 1.4375 2.4092 3.3889 1.4394 1.3840 3.1059 3.6697 4.7813 4.0505 3.6277 3.8766 3.9202 1.1600 4.5412 4.5885 2.6812 4.0551 3.2557 3.6335 6.0141 4.1870 2.8293 5.0360 3.7893 4.8871 3.8106 2.8643 5.8951 4.2391 3.8042 5.3846 2.7890 3.5560 2.5252 3.0597 3.3841 3.1302 3.0259 2.1556 3.1153 2.5129 1.1418 1.2388 1.2649 1.2833 1.2823 1.2587 1.2968 1.1848 1.2621 1.3444 1.2470 1.1850 1.2344 1.3553 1.3445 1.2571 1.2860 1.3060 1.2805 1.2627 1.3184 1.2680 1.2598 1.3222 1.2053 1.6869 1.2799 1.4359 1.3652 1.4138 1.3412 1.0858 1.0839 1.2155 1.0818 1.0837 1.0695 1.0817 1.0824 1.0845 1.0669 1.0835 1.0850 1.0842 1.0883 1.0871 1.0933 1.0992 1.0687 1.0644 1.0672 1.0654 1.0653 1.0655 1.0658 1.0664
irintensity: 0.9377 1.1621 3.0157 0.9890 1.1199 4.7808 4.5114 5.5125 0.3662 2.0666 2.9252 4.6487 2.6894 15.5812 0.7824 0.4156 7.6008 36.3886 3.8907 14.8410 9.3642 5.6134 14.1996 30.5301 14.9032 15.8570 110.6263 146.3451 21.0783 41.7695 1.1790 188.2487 19.6263 78.0339 11.4022 138.5103 224.7018 57.9463 19.2182 3.0590 3.9600 6.5190 10.1186 96.0352 205.8342 21.6971 40.4738 13.2002 47.1887 34.8488 4.2317 159.2535 131.1616 14.4069 136.8392 32.0979 334.3822 26.1702 41.6625 28.2011 53.5865 56.1694 122.3135 33.0928 35.6234 50.5095 61.0945 26.4075 26.7227 96.8298 17.5154 8.2239 32.1684 45.1357 47.6400 55.5534 17.1426 15.6497 10.6172 25.2013 25.5919 30.1861 13.8079 0.5480 20.9982 3.0374 13.4936 25.2917 21.7955 5.0565 10.0840 22.8496 5.0903 55.3174 14.6244 17.4574 8.0819 33.1140 34.0471 22.7311 14.0266 17.4388 13.9155 3.4847 10.1886 2.6450 37.2342 28.1062 29.1170 55.0809 2.3837 13.6606 23.2562 26.0014 48.9213 37.7273 16.2467 57.4901 11.1581 26.5364 28.5092 645.2329 39.1853 64.6523 4.6463 19.5814 14.7665 23.6121 17.1650
temp: 298.150 k
press: 1.00000 atm
elementType: 8 8 8 8 8 8 8 8 8 8 8 6 6 6 6 6 6 6 6 6 6 6 6 1 1 1 1 1 1 1 1 1 1 1 1 1 1 1 1 1 1 1 1 1 1
symmnumber: 1
zpe: 936481.1 jmol-1
zpe.correction: 0.356687 hartree
zpe.thermalcorrener: 0.380935 hartree
zpe.thermalcorrenthalpy: 0.381879 hartree
zpe.thermalcorrgfe: 0.303270 hartree
zpe.sumelectzpe: -1295.996820 hartree
zpe.sumelectthermal: -1295.972572 hartree
zpe.sumelectthermalent: -1295.971627 hartree
zpe.sumelectthermalfe: -1296.050237 hartree
dipole: 0.4125 -0.4883 -1.1046
dipole: 1.2762
quadrupole: -165.3101 -151.4457 -136.5388
quadrupole: 11.2654 -3.6292 -4.1139
quadrupole: -14.2119 -0.3475 14.5594 11.2654 -3.6292 -4.1139
hfenergy: -1296.3535068 hartree
pointgroup: C01 [X(C12H22O11)]
dipole: -0.159028 0.1937965 -0.4350395 debye
polarizability: 201.4945054|-1.0416425|174.3010056|2.2602|-0.2040528|127.2657231 unknown
InChI: InChI=1S/C12H22O11/c13-1-3-5(15)6(16)9(19)12(22-3)23-10-4(2-14)21-11(20)8(18)7(10)17/h3-20H,1-2H2
charge 0 multiplicity 1
45 atoms
O  0.103134 -0.885104 0.443622
O  -1.500478 0.806508 0.058129
O  3.67243 -0.85196 -0.718192
O  0.79945 2.088997 0.158955
O  -2.093365 -2.896766 0.157896
O  -4.6874 -1.808599 0.603189
O  -4.040101 0.918325 1.432352
O  3.586855 2.598322 0.594808
O  4.525582 0.135296 1.268614
O  3.251262 -3.658961 -0.590712
O  -1.789916 3.31343 -1.50267
C  1.305861 -0.344353 -0.265588
C  1.740189 0.988741 0.379129
C  -1.150541 -0.622184 -0.179118
C  2.427496 -1.38845 -0.101824
C  -2.242285 -1.475667 0.483143
C  -3.631118 -1.076008 -0.071838
C  -3.903975 0.447315 0.055127
C  3.081693 1.47321 -0.199248
C  -2.756698 1.196192 -0.663272
C  4.164239 0.372802 -0.119737
C  2.1789 -2.703315 -0.8461
C  -2.812327 2.726779 -0.63501
H  1.060556 -0.193788 -1.339269
H  1.858477 0.804762 1.468093
H  -1.106631 -0.790897 -1.280052
H  2.615676 -1.579703 0.971921
H  -2.19996 -1.312964 1.580169
H  -3.622352 -1.324306 -1.16011
H  -4.879279 0.670379 -0.41005
H  -2.665584 0.86844 -1.720481
H  2.927464 1.770497 -1.255616
H  5.052511 0.634102 -0.722471
H  1.255179 -3.178449 -0.478951
H  2.075451 -2.4920 -1.933167
H  -3.776025 3.061465 -1.053667
H  -2.741793 3.091256 0.408881
H  -0.132804 1.730289 0.314375
H  -1.306927 -3.262234 0.63579
H  -4.44674 -2.771477 0.565215
H  -3.15491 0.841608 1.875991
H  2.850475 3.255922 0.690608
H  4.503832 1.024135 1.720142
H  4.110162 -3.190503 -0.759285
H  -0.882566 3.137918 -1.13742
