program: Gaussian 09
title: 000016177
version: EM64L-G09RevD.01
frameworkgroup: C1[X(C10H9NO7S2)]
method: RPBEPBE
basis: SDD
operation: Freq
keyword: #p
keyword: freq=noraman
keyword: PBEPBE/SDD
title: #p freq=noraman PBEPBE/SDD
converged: YES YES NO NO
title: Mulliken charges:
elementType: S S O O O O O O O N C C C C C C C C C C H H H H H H H H H
charge: 0.982317 0.988301 -0.438978 -0.546597 -0.566715 -0.468069 -0.532108 -0.499868 -0.499272 -0.680440 0.484709 0.298824 0.213980 -0.237919 -0.527254 -0.422137 0.170717 -0.079489 -0.334008 -0.266506 0.288193 0.298564 0.221635 0.286031 0.369098 0.324813 0.395792 0.392057 0.384330
chargesum: 0.00000
title: Mulliken charges with hydrogens summed into heavy atoms:
elementType: S S O O O O O O O N C C C C C C C C C C
charge: 0.982317 0.988301 -0.043187 -0.154540 -0.182385 -0.468069 -0.532108 -0.499868 -0.499272 0.013470 0.484709 0.298824 0.213980 -0.237919 -0.239061 -0.123573 0.170717 -0.079489 -0.112373 0.019525
polarizability: 3.24664718e+02 -7.33922354e-01 2.14950823e+02 -2.03856058e+00 -1.49761707e+00 1.10319538e+02
1716.lowfreq: -0.0013 -0.0010 -0.0009 1.4439 4.1932 6.2480 24.3899 34.2078 59.1932
frequency: 24.3862 34.2030 59.1928 71.4958 80.7657 115.8730 129.9177 142.1930 170.0781 176.0797 185.2152 191.8848 238.7815 248.7880 256.8772 274.4122 291.7132 301.0106 319.5142 326.5366 338.0628 349.2981 365.8428 367.8623 384.9911 410.4139 430.8504 465.6513 480.3703 519.0680 537.7039 545.6544 566.8175 576.1913 592.6355 601.7286 629.9502 696.5238 705.9539 762.5032 774.9268 785.3140 801.5226 827.4084 832.2495 862.2805 886.7868 914.2602 942.0965 952.0782 963.1852 968.7672 1047.7474 1060.3958 1062.2690 1121.5584 1128.1727 1177.9072 1218.9663 1255.4311 1268.8907 1348.6732 1383.2195 1400.4903 1442.1620 1447.3319 1480.8618 1522.4937 1580.6961 1587.7842 1614.6958 1630.5090 3036.1722 3143.7103 3150.6981 3164.7287 3174.3913 3469.2620 3479.9024 3550.3508 3706.8140
redmass: 9.2843 8.6034 6.5932 5.7406 10.2141 4.3192 6.9781 9.2833 4.6127 1.9150 2.4107 5.2501 3.0083 5.5549 5.2076 3.0049 5.5869 4.9289 5.4923 7.4968 2.5958 2.1537 5.3744 8.5073 6.1169 9.2682 7.7671 3.4053 7.9938 7.7078 5.9028 10.2827 1.4934 3.0029 4.3859 5.0751 5.3878 5.8873 5.4436 1.8554 2.4786 1.3953 11.3042 1.4455 11.4438 2.9673 5.7935 3.2223 1.7292 8.7443 1.4740 9.0760 1.2246 1.2798 1.9885 2.7689 1.7135 1.4836 1.7056 2.0868 2.4802 1.9364 2.6713 3.6516 2.9664 2.5420 7.5596 4.7230 3.9804 6.6626 6.0720 1.3809 1.0691 1.0882 1.0929 1.0928 1.0965 1.0661 1.0661 1.0469 1.1018
irintensity: 1.7758 1.4788 0.0748 0.1487 0.6009 4.6966 1.0275 0.9889 15.6711 41.4939 30.5765 3.0347 35.4077 20.1747 14.7301 45.1573 15.1090 53.5892 11.5574 14.9606 43.0231 37.3873 5.1581 65.5780 4.9773 57.7844 74.6304 59.2458 6.5988 55.4540 110.0029 57.4069 29.7369 67.3130 155.5657 88.6020 15.8532 17.8433 5.5781 42.6952 23.3369 126.0070 56.6539 29.1109 104.4996 3.9829 0.7987 31.4867 21.7613 86.3749 9.8452 80.6018 65.2018 53.4603 103.7107 9.0710 74.9406 61.8543 44.5320 21.7163 26.2873 22.9194 318.4965 2.6007 27.4816 0.4318 44.6778 7.4794 16.9226 32.9271 34.4936 325.4956 547.4019 8.8305 5.0789 9.1594 7.9346 61.8459 47.9635 139.3881 36.8418
temp: 298.150 k
press: 1.00000 atm
elementType: 16 16 8 8 8 8 8 8 8 7 6 6 6 6 6 6 6 6 6 6 1 1 1 1 1 1 1 1 1
symmnumber: 1
zpe: 485290.0 jmol-1
zpe.correction: 0.184837 hartree
zpe.thermalcorrener: 0.205304 hartree
zpe.thermalcorrenthalpy: 0.206248 hartree
zpe.thermalcorrgfe: 0.135429 hartree
zpe.sumelectzpe: -1762.101936 hartree
zpe.sumelectthermal: -1762.081469 hartree
zpe.sumelectthermalent: -1762.080525 hartree
zpe.sumelectthermalfe: -1762.151345 hartree
dipole: -1.8977 4.1867 0.0855
dipole: 4.5975
quadrupole: -147.6675 -117.3892 -138.4592
quadrupole: 4.1172 19.8785 2.6533
quadrupole: -13.1622 17.1161 -3.9538 4.1172 19.8785 2.6533
hfenergy: -1762.2867735 hartree
pointgroup: C01 [X(C10H9N1O7S2)]
dipole: -0.70093 1.6643578 0.1016972 debye
polarizability: 324.5365643|-3.8630703|214.9723267|1.993151|3.6395475|110.4261879 unknown
InChI: InChI=1S/C10H9NO7S2/c11-9-7-2-1-6(19(13,14)15)3-5(7)4-8(10(9)12)20(16,17)18/h1-4,12-13,16H,11H2
charge 0 multiplicity 1
29 atoms
S  -3.711574 -1.230673 -0.017043
S  4.323822 -0.900809 -0.10826
O  -3.450807 1.917209 0.124603
O  -3.823443 -1.436421 -1.846752
O  4.597143 -0.904479 1.730649
O  -3.555348 -2.680954 0.662789
O  -4.93927 -0.245888 0.455747
O  5.440637 0.056386 -0.783474
O  4.127986 -2.425691 -0.611402
N  -1.228441 3.340006 0.117085
C  0.25595 -0.149557 -0.015268
C  0.20505 1.304213 0.015999
C  -1.072513 1.968755 0.065187
C  -2.154429 -0.223741 0.01452
C  -0.943693 -0.915542 -0.024229
C  1.530551 -0.80532 -0.041563
C  -2.268531 1.193779 0.062125
C  2.675011 -0.027491 -0.045824
C  1.438892 2.038972 0.005279
C  2.67399 1.393925 -0.02362
H  -0.915725 -2.008562 -0.047316
H  1.593393 -1.898483 -0.071876
H  1.433467 3.133728 0.0153
H  3.61641 1.947979 -0.048504
H  -2.178106 3.708085 0.151471
H  -0.442156 3.979359 0.148869
H  -4.24896 1.296856 0.251038
H  -4.603893 -2.034071 -2.043944
H  5.496287 -1.311269 1.902313
