program: Gaussian 09
title: 000083967
version: EM64L-G09RevD.01
frameworkgroup: C1[X(C13H16N2O5S)]
method: RPBEPBE
basis: SDD
operation: Freq
keyword: #p
keyword: freq=noraman
keyword: PBEPBE/SDD
title: #p freq=noraman PBEPBE/SDD
converged: YES YES NO NO
title: Mulliken charges:
elementType: S O O O O O N N C C C C C C C C C C C C C H H H H H H H H H H H H H H H H
charge: 0.221576 -0.393933 -0.483791 -0.234716 -0.288199 -0.257733 -0.388036 -0.457754 -0.104696 -0.702223 -0.357745 -0.462329 0.184901 0.516709 0.396355 -0.332719 -0.360188 0.262948 -0.772779 0.224974 -0.779881 0.298446 0.283853 0.292788 0.389321 0.252564 0.317232 0.228193 0.309002 0.253160 0.251853 0.204703 0.382165 0.369972 0.260581 0.261047 0.214378
chargesum: 0.00000
title: Mulliken charges with hydrogens summed into heavy atoms:
elementType: S O O O O O N N C C C C C C C C C C C C C
charge: 0.221576 -0.011768 -0.113819 -0.234716 -0.288199 -0.257733 0.001285 -0.148751 0.193750 -0.125582 -0.357745 -0.209765 0.184901 0.516709 0.396355 -0.015487 -0.131995 0.262948 -0.063063 0.224974 -0.043875
polarizability: 2.67139787e+02 -9.72460519e+00 1.85963406e+02 -1.39957053e+01 -1.87137798e+01 1.42865913e+02
1716.lowfreq: -7.4652 -2.6672 -0.0019 -0.0012 0.0010 4.3268 10.9755 25.3691 39.6822
frequency: 10.5859 25.3226 39.6654 50.3821 52.5878 60.0595 69.1500 75.0409 83.9595 90.2309 102.7495 116.3535 141.6721 179.4200 193.7395 224.7155 233.1172 266.8687 294.5659 319.4422 330.7210 347.0731 359.2624 376.7854 393.1867 445.6179 458.6422 479.5858 501.5970 508.2920 518.3090 574.3244 586.1031 600.3329 609.0358 622.1830 624.6987 643.2571 646.0849 688.7500 702.9520 719.0480 775.0034 787.9170 798.2676 823.7868 866.0734 889.2569 913.0119 947.0455 951.4210 975.0548 990.0476 996.6890 1010.7191 1029.8853 1040.5048 1042.9113 1078.6050 1126.0260 1134.8029 1162.5245 1212.1691 1215.5891 1226.1094 1229.9047 1254.4723 1280.3506 1293.1012 1302.8733 1303.0955 1329.7471 1363.6723 1383.4441 1389.8772 1393.8760 1411.2985 1449.2683 1450.0278 1466.4980 1470.1052 1488.2165 1504.5719 1511.5463 1589.5906 1611.9685 1616.1864 1624.1952 1647.5295 2928.5748 2996.1825 2996.8281 3052.4074 3090.8111 3098.4992 3099.5340 3112.6254 3119.6360 3127.3585 3136.2773 3195.5810 3398.1189 3510.4854 3536.4253 3588.2879
redmass: 6.4180 6.8566 10.6659 5.5080 4.6432 3.0820 1.3191 1.6180 2.9471 3.3591 3.4751 4.1641 5.7470 6.6395 7.0198 5.1993 7.6518 3.8820 5.5664 3.6297 1.2583 3.0690 4.3405 5.2898 5.8323 3.6570 2.9618 4.8832 4.1811 4.5149 3.8100 3.4535 3.5822 3.3089 2.6696 5.8259 4.2200 1.4341 1.5703 6.7434 4.2344 3.4606 4.5961 1.4353 2.0201 1.4477 5.3297 1.5866 2.4802 6.4214 5.1870 1.3121 1.7967 1.5808 2.2069 3.3268 1.6302 1.6589 1.9614 1.5060 1.8415 1.1814 1.6296 2.5906 1.7349 1.6712 1.7015 1.9376 1.3559 1.8126 1.7184 2.0933 3.9632 1.2447 1.9427 2.0922 1.0921 1.0448 1.0663 1.0875 1.1020 3.0064 2.1446 1.8267 6.5676 6.7216 4.8596 4.6669 9.2046 1.0787 1.0360 1.0363 1.0575 1.0986 1.0991 1.0995 1.0996 1.0909 1.0919 1.1086 1.0948 1.0828 1.0639 1.0768 1.0659
irintensity: 0.5229 0.5036 3.8120 1.6667 9.8704 1.1208 0.5066 4.1590 1.3632 5.0333 2.2578 3.5428 6.6090 2.9085 5.9905 7.6822 3.2298 8.9200 0.7069 6.2288 119.5414 5.6282 4.2337 0.6594 0.3962 2.7159 18.3237 21.5930 6.7575 22.4024 37.2441 5.1999 48.3763 15.3894 44.2566 0.4001 1.3693 9.4550 121.9723 3.4046 34.7363 3.0029 3.6023 150.3071 63.0090 45.5089 6.5803 31.9326 30.8138 3.5612 22.3914 4.5046 31.8437 15.4756 48.8818 11.7326 14.6515 7.5439 171.0547 187.0690 14.1642 51.4654 30.4514 43.2854 66.2169 15.0212 11.5535 51.2984 18.8761 142.4837 60.6959 18.1883 87.7113 61.8575 39.3413 21.3714 16.3277 14.9720 27.8687 16.1639 27.1526 394.1570 210.2170 214.6663 42.6974 17.8334 174.0725 133.1103 232.9287 50.1790 10.8471 11.6494 8.7831 19.4679 12.0878 13.2863 14.2225 15.4369 3.8945 1.7162 10.7756 315.9005 31.3845 13.4615 49.6116
temp: 298.150 k
press: 1.00000 atm
elementType: 16 8 8 8 8 8 7 7 6 6 6 6 6 6 6 6 6 6 6 6 6 1 1 1 1 1 1 1 1 1 1 1 1 1 1 1 1
symmnumber: 1
zpe: 733980.4 jmol-1
zpe.correction: 0.279558 hartree
zpe.thermalcorrener: 0.302068 hartree
zpe.thermalcorrenthalpy: 0.303012 hartree
zpe.thermalcorrgfe: 0.224088 hartree
zpe.sumelectzpe: -1387.134682 hartree
zpe.sumelectthermal: -1387.112172 hartree
zpe.sumelectthermalent: -1387.111228 hartree
zpe.sumelectthermalfe: -1387.190152 hartree
dipole: -3.2198 -0.3785 -1.9904
dipole: 3.8043
quadrupole: -135.2769 -131.4510 -128.6402
quadrupole: 17.8609 -23.7361 -17.7167
quadrupole: -3.4875 0.3384 3.1491 17.8609 -23.7361 -17.7167
hfenergy: -1387.4142399 hartree
pointgroup: C01 [X(C13H16N2O5S1)]
dipole: 1.226632 -0.8570901 -0.0301595 debye
polarizability: 268.4816163|8.8250032|134.4633228|-5.0621176|-2.2277537|193.0241669 unknown
InChI: InChI=1S/C13H16N2O5S/c1-7(16)14-9-3-4-11(18)12(5-9)21-6-10(13(19)20)15-8(2)17/h3-5,10,14-15,18-19H,6H2,1-2H3
charge 0 multiplicity 1
37 atoms
S  -1.135204 -1.159246 -1.478216
O  -4.852883 -0.546807 0.406742
O  -0.672021 -1.455314 1.568632
O  -4.575726 -0.470839 -1.894599
O  -3.215856 2.893025 1.38254
O  5.663014 0.088079 0.257549
N  -2.507137 0.730697 0.896378
N  3.954945 0.040845 -1.352101
C  -3.008114 0.798227 -0.468859
C  -1.913987 0.589662 -1.533454
C  0.416067 -0.864227 -0.527449
C  1.583203 -0.487389 -1.224924
C  -4.195346 -0.134748 -0.750951
C  2.831413 -0.342728 -0.564599
C  0.505888 -1.105997 0.867294
C  2.909763 -0.594041 0.831157
C  1.746683 -0.967829 1.530961
C  -2.665278 1.807869 1.753057
C  -2.149917 1.599641 3.171502
C  5.27647 0.235446 -0.939653
C  6.238038 0.645092 -2.052216
H  -3.402508 1.835908 -0.57735
H  -1.102436 1.321424 -1.403207
H  -2.345408 0.666256 -2.543742
H  -2.050587 -0.136685 1.213507
H  1.505928 -0.327314 -2.307294
H  3.868528 -0.49056 1.341436
H  1.811033 -1.148516 2.611842
H  3.764207 0.1891 -2.34529
H  -1.604735 2.501434 3.494335
H  -3.010571 1.4711 3.852372
H  -1.490933 0.719151 3.261555
H  -5.632682 -1.110245 0.148253
H  -0.454147 -1.824337 2.459824
H  7.046593 -0.103047 -2.120161
H  6.707102 1.606929 -1.782707
H  5.764102 0.746584 -3.043965
