program: Gaussian 09
title: 000083356
version: EM64L-G09RevD.01
frameworkgroup: C1[X(C12H15N3O3S2)]
method: RPBEPBE
basis: SDD
operation: Freq
keyword: #p
keyword: freq=noraman
keyword: PBEPBE/SDD
title: #p freq=noraman PBEPBE/SDD
converged: NO YES NO NO
title: Mulliken charges:
elementType: S S O O O N N N C C C C C C C C C C C C H H H H H H H H H H H H H H H
charge: 0.046979 1.003538 -0.562487 -0.472574 -0.553814 -0.402416 -0.060395 -0.629336 0.342795 0.123924 -0.539855 0.228485 -0.423347 -0.483775 -0.377767 -0.335210 -0.333718 -0.238875 0.320318 -0.857753 0.234756 0.213286 0.278975 0.236769 0.186363 0.313557 0.257411 0.239384 0.263376 0.249085 0.323191 0.301968 0.338126 0.372483 0.396554
chargesum: 0.00000
title: Mulliken charges with hydrogens summed into heavy atoms:
elementType: S S O O O N N N C C C C C C C C C C C C
charge: 0.046979 1.003538 -0.165933 -0.472574 -0.553814 -0.088859 -0.060395 0.081273 0.342795 0.123924 -0.091813 0.228485 -0.144372 -0.060643 -0.120356 -0.095827 -0.070342 0.010210 0.320318 -0.232594
polarizability: 3.71921677e+02 3.16309242e+01 2.54159894e+02 1.87709367e+01 -1.15749258e+01 1.72776071e+02
1716.lowfreq: -14.9894 -3.3159 -0.0027 -0.0022 -0.0015 3.8267 24.9443 31.0361 48.8533
frequency: 24.6209 31.0073 48.8137 66.7179 71.1201 86.7994 113.7511 121.6305 133.1017 140.4139 145.4849 176.0621 201.4961 224.8353 226.5107 244.7095 271.7532 285.9228 303.3410 334.2935 382.0207 404.7089 417.5433 421.4859 445.7079 457.0698 500.8292 532.3497 532.9591 542.2663 556.6554 574.6629 575.8215 632.1331 645.2851 688.6921 720.6102 749.8787 761.0851 764.5402 773.8633 783.8658 806.3116 811.8377 858.1813 861.0301 866.0704 893.7541 927.0826 932.6845 944.2070 990.0384 999.4657 1008.0487 1030.9572 1065.3085 1066.5744 1099.0476 1107.7974 1131.3698 1161.6499 1167.2787 1180.4250 1237.7829 1239.5569 1251.6014 1267.2356 1291.7151 1294.8194 1340.9553 1352.0408 1357.8709 1391.4619 1400.0831 1420.9133 1453.9894 1460.8668 1478.3247 1485.7475 1537.2012 1578.7000 1595.6326 1625.7033 1644.6117 2905.3412 2991.5030 3013.0601 3026.4125 3057.5568 3089.2146 3137.5059 3145.9097 3159.1829 3172.6619 3217.3396 3269.3980 3296.6954 3579.3901 3605.8732
redmass: 5.9557 6.6173 7.7441 8.3745 6.2660 7.9192 6.5535 4.2021 7.1683 7.4217 8.7069 4.8411 7.4471 3.7522 3.7047 4.3890 9.9814 2.5929 8.3482 4.2347 2.6233 8.2469 1.7241 1.7061 2.8620 3.5702 1.7405 8.8377 2.9162 1.6628 3.6563 2.6736 2.3910 3.6304 3.7783 4.0438 6.7606 4.6141 3.9022 1.2034 1.3115 2.7289 1.4424 7.4518 2.1817 1.4707 4.6769 2.5869 3.7958 3.6807 1.5356 1.2704 2.5042 2.2396 1.8991 2.3546 1.5098 1.6059 1.2679 1.4743 1.3037 1.1983 1.2186 2.3184 1.2032 1.4395 1.3153 1.3541 1.9748 1.3381 1.7701 2.5480 4.9366 1.2957 2.3145 2.3091 1.4001 2.7361 1.1429 5.3131 6.0195 5.1794 6.6209 1.1900 1.0683 1.0630 1.0581 1.0911 1.0997 1.1036 1.0863 1.0894 1.0949 1.0996 1.0980 1.0677 1.0622 1.0903 1.0811
irintensity: 0.7275 0.1640 0.3905 0.8170 0.1657 0.3737 8.7213 3.6470 0.8643 9.2522 15.1026 0.6266 12.9061 8.0803 5.0054 1.9705 13.6645 9.3020 19.3858 3.0065 0.7984 24.3671 30.8315 42.0586 12.3450 7.7213 31.6207 110.6288 28.6790 44.2409 6.6957 36.5585 64.9130 18.1530 13.6940 0.2679 3.0165 4.7394 7.9259 226.8036 120.6353 3.7354 26.1792 61.6555 0.9160 1.4102 0.6900 2.2529 8.1785 74.4595 11.3685 0.9167 4.4494 2.3064 12.0120 9.9764 49.4206 45.7425 10.2420 25.2632 9.5337 4.9088 1.1998 19.3512 39.5524 22.6529 10.8705 1.0704 0.8106 5.7514 37.5268 20.2852 21.3579 56.6613 15.5947 6.5573 22.9828 0.4067 7.4465 132.9184 7.5219 26.9186 4.8154 87.6599 86.6696 36.9508 6.4651 71.3468 10.6469 13.1783 1.0036 3.9531 11.4063 7.9129 1.3935 112.6301 11.7860 19.3195 100.9221
temp: 298.150 k
press: 1.00000 atm
elementType: 16 16 8 8 8 7 7 7 6 6 6 6 6 6 6 6 6 6 6 6 1 1 1 1 1 1 1 1 1 1 1 1 1 1 1
symmnumber: 1
zpe: 684260.4 jmol-1
zpe.correction: 0.260621 hartree
zpe.thermalcorrener: 0.281248 hartree
zpe.thermalcorrenthalpy: 0.282192 hartree
zpe.thermalcorrgfe: 0.210336 hartree
zpe.sumelectzpe: -1650.676531 hartree
zpe.sumelectthermal: -1650.655903 hartree
zpe.sumelectthermalent: -1650.654959 hartree
zpe.sumelectthermalfe: -1650.726815 hartree
dipole: -8.4028 0.3834 -1.7479
dipole: 8.5912
quadrupole: -142.8571 -127.8265 -130.0520
quadrupole: -8.7165 16.4376 -1.7786
quadrupole: -9.2786 5.7520 3.5265 -8.7165 16.4376 -1.7786
hfenergy: -1650.9371515 hartree
pointgroup: C01 [X(C12H15N3O3S2)]
dipole: -3.0660383 -1.0582023 -0.9509961 debye
polarizability: 336.2972565|69.9746316|269.3115189|28.8689322|-25.6792598|193.248866 unknown
InChI: InChI=1S/C12H14N3S.HO3S/c13-12(8-16)14-6-5-9-7-15-11-4-2-1-3-10(9)11;1-4(2)3/h1-4,7,15H,5-6,8,13H2;1H
charge 0 multiplicity 1
35 atoms
S  2.51802 -0.077114 1.883613
S  3.339349 1.015618 -0.263843
O  2.154567 2.410878 -0.468654
O  4.777118 1.732357 -0.26463
O  3.057801 -0.112718 -1.416127
N  -2.629995 0.020693 -1.999608
N  0.167177 -2.764032 1.416508
N  0.878371 -1.811398 -0.707435
C  -2.28498 -1.101752 -0.028411
C  -1.763239 0.250466 0.102418
C  -2.285105 -2.195061 1.010622
C  -1.993568 0.931807 -1.147268
C  -2.806547 -1.195262 -1.326212
C  -1.122586 -3.243961 0.887528
C  -1.114116 0.947124 1.154037
C  -1.6004 2.268294 -1.369697
C  -0.721687 2.285628 0.944449
C  -0.962953 2.940923 -0.304173
C  1.035611 -2.163348 0.62104
C  2.388777 -1.833866 1.213785
H  -2.236129 -1.76225 2.026452
H  -3.23382 -2.762759 0.949539
H  -3.309783 -2.033264 -1.806791
H  -1.412191 -4.114182 1.505446
H  -1.069526 -3.592739 -0.170676
H  -2.937227 0.218157 -2.949781
H  -0.897599 0.449433 2.104496
H  -1.773564 2.771839 -2.326675
H  -0.239862 2.842554 1.754658
H  -0.647996 3.981483 -0.435284
H  2.565915 -2.479608 2.091775
H  3.203981 -1.980057 0.48276
H  -0.039477 -1.87489 -1.149283
H  1.624098 -1.27089 -1.175984
H  1.226562 2.1107 -0.199598
