program: Gaussian 09
title: 000078169
version: EM64L-G09RevD.01
frameworkgroup: C1[X(C12H14N2O3)]
method: RPBEPBE
basis: SDD
operation: Freq
keyword: #p
keyword: freq=noraman
keyword: PBEPBE/SDD
title: #p freq=noraman PBEPBE/SDD
converged: YES YES NO NO
title: Mulliken charges:
elementType: O O O N N C C C C C C C C C C C C H H H H H H H H H H H H H H
charge: -0.255933 -0.252627 -0.256988 -0.455627 -0.440441 0.496992 0.504835 -0.347200 -0.447542 -0.347507 -0.441801 -0.623215 0.175697 0.283124 0.208078 -0.765723 -0.801029 0.305273 0.234838 0.359265 0.307744 0.218063 0.271546 0.265288 0.306419 0.251525 0.261569 0.245354 0.236341 0.269162 0.234521
chargesum: 0.00000
title: Mulliken charges with hydrogens summed into heavy atoms:
elementType: O O O N N C C C C C C C C C C C C
charge: -0.255933 -0.252627 -0.256988 -0.096362 -0.134022 0.496992 0.504835 -0.041927 -0.212704 -0.039763 -0.223739 -0.086382 0.175697 0.283124 0.208078 -0.007275 -0.061005
polarizability: 2.78883226e+02 -8.82489443e+00 1.55036819e+02 1.88841941e+00 3.34993710e+00 7.88924045e+01
1716.lowfreq: -84.2673 -8.1390 -2.3608 -0.0004 0.0005 0.0005 5.7655 24.6640 44.8407
frequency: -84.2614 24.5878 44.8328 51.2620 67.4722 76.0015 85.6349 110.8361 132.1376 146.1274 202.5511 213.2286 258.3934 301.3179 336.4421 367.1059 380.5649 394.4979 412.1310 452.5417 494.6143 526.1844 557.5319 574.9819 581.9223 611.7366 635.3132 637.1822 691.7430 730.1637 804.3692 814.6096 819.0462 835.0199 878.4676 883.4161 895.3454 923.2601 935.7320 938.1889 981.0837 984.6195 1006.9830 1008.9908 1022.7463 1029.4300 1129.4115 1160.2987 1178.5330 1191.4940 1211.1971 1218.6500 1257.0209 1281.6716 1305.0922 1314.0954 1373.6946 1375.4372 1376.2262 1417.4133 1421.6472 1440.8112 1447.7729 1451.8673 1468.5486 1488.8389 1512.7311 1557.8665 1595.0460 1603.8832 1631.0326 1633.9154 1643.4887 2972.6414 2982.7638 2986.1272 3064.8465 3070.9869 3083.7097 3109.4826 3128.1014 3136.2000 3136.6075 3185.4748 3200.7018 3296.1481 3519.9990
redmass: 1.0474 4.3804 4.4663 3.6763 4.7251 4.9662 3.3795 5.0482 3.7114 1.3300 5.0476 4.8089 5.0739 6.0968 3.4522 5.5920 4.2002 4.9207 3.1198 2.5965 4.0298 2.5976 3.8393 3.7592 3.0041 4.9508 6.4864 1.1745 5.3326 3.8015 1.7585 2.3461 2.3381 4.0036 1.5490 1.4500 1.8231 5.5710 2.5692 1.8843 1.8730 1.7733 2.4573 1.3015 1.8049 1.6541 1.3276 1.5250 1.9274 1.1666 2.9893 3.2027 1.7878 2.8225 1.5885 1.6545 1.6029 1.2508 2.8405 1.1019 3.6726 1.0770 1.1645 1.0535 1.0471 1.8202 3.0308 2.1169 5.3130 7.5341 5.6927 5.5354 3.1586 1.0671 1.0386 1.0384 1.0954 1.0984 1.0912 1.0877 1.1003 1.0977 1.0968 1.0903 1.0961 1.0807 1.0763
irintensity: 0.0096 0.5866 8.9771 3.8822 1.0318 3.3701 12.4407 2.2012 0.1633 0.7862 18.9673 4.1275 9.1391 0.3817 8.0951 5.8540 1.2248 1.6234 0.0164 3.9736 2.9562 34.9062 21.0662 14.5271 1.0982 1.4471 6.1129 64.1217 3.5120 0.2120 4.3391 16.3353 9.9771 13.3914 37.5727 88.5878 29.1529 0.7664 9.3922 10.9003 29.6097 16.4739 2.7526 0.0224 21.0113 8.2158 19.0389 26.6710 6.0543 6.5487 116.1556 37.7712 122.7791 29.3708 169.8444 12.4010 39.2900 70.8174 83.5248 52.6436 37.2501 23.9963 78.9444 19.6891 19.6467 282.3049 581.9661 244.7703 159.7056 68.5976 34.6184 140.6898 186.6426 2.3042 1.1957 10.9549 7.9377 16.7003 7.8853 23.6114 10.8205 5.2748 14.6757 3.8325 2.6971 328.1388 11.2339
temp: 298.150 k
press: 1.00000 atm
elementType: 8 8 8 7 7 6 6 6 6 6 6 6 6 6 6 6 6 1 1 1 1 1 1 1 1 1 1 1 1 1 1
symmnumber: 1
zpe: 636543.9 jmol-1
zpe.correction: 0.242447 hartree
zpe.thermalcorrener: 0.258828 hartree
zpe.thermalcorrenthalpy: 0.259772 hartree
zpe.thermalcorrgfe: 0.196496 hartree
zpe.sumelectzpe: -799.643439 hartree
zpe.sumelectthermal: -799.627057 hartree
zpe.sumelectthermalent: -799.626113 hartree
zpe.sumelectthermalfe: -799.689389 hartree
dipole: -2.7471 -5.0828 -0.3817
dipole: 5.7903
quadrupole: -60.7173 -108.4153 -100.8152
quadrupole: -20.7198 -1.2942 -0.3248
quadrupole: 29.2653 -18.4327 -10.8326 -20.7198 -1.2942 -0.3248
hfenergy: -799.8858854 hartree
pointgroup: C01 [X(C12H14N2O3)]
dipole: 1.0071333 1.9287675 0.6746662 debye
polarizability: 278.7688233|0.0321388|143.8365341|-11.7860624|26.5091005|90.207092 unknown
InChI: InChI=1S/C12H14N2O3/c1-8(15)7-12(17)14-11-5-3-10(4-6-11)13-9(2)16/h3-6,13-14H,7H2,1-2H3
charge 0 multiplicity 1
31 atoms
O  2.252391 -1.854521 -1.157958
O  4.01087 1.725096 0.441748
O  -4.651781 -1.552361 -0.393745
N  1.793185 0.32264 -0.374985
N  -3.854543 0.545479 0.302261
C  0.377513 0.301066 -0.227782
C  -2.448368 0.41627 0.10855
C  -0.433046 -0.818087 -0.55468
C  -0.241816 1.478354 0.27172
C  -1.831428 -0.761854 -0.389026
C  -1.634958 1.534549 0.436851
C  4.125001 -0.31996 -0.900785
C  2.622639 -0.693819 -0.80597
C  4.692097 0.726238 0.05993
C  -4.86427 -0.390817 0.061413
C  6.1197 0.522232 0.526843
C  -6.266493 0.120446 0.401056
H  0.039152 -1.726172 -0.934058
H  0.370459 2.350142 0.532164
H  2.288806 1.182745 -0.077744
H  -2.453189 -1.622661 -0.640417
H  -2.093341 2.45358 0.82462
H  4.293095 0.063856 -1.930495
H  4.692262 -1.26268 -0.831037
H  -4.161833 1.449873 0.668896
H  6.165591 -0.354644 1.201841
H  6.480742 1.411292 1.065587
H  6.785612 0.2997 -0.327466
H  -6.353876 0.368526 1.475352
H  -6.992689 -0.669332 0.161881
H  -6.519883 1.024727 -0.183165
