program: Gaussian 09
title: 000018990
version: EM64L-G09RevD.01
frameworkgroup: C1[X(C12H10N4O6)]
method: RPBEPBE
basis: SDD
operation: Freq
keyword: #p
keyword: freq=noraman
keyword: PBEPBE/SDD
title: #p freq=noraman PBEPBE/SDD
converged: YES YES NO NO
title: Mulliken charges:
elementType: O O O O O O N N N N C C C C C C C C C C C C H H H H H H H H H H
charge: -0.168902 -0.168884 -0.192579 -0.192606 -0.203805 -0.203804 -0.126028 -0.362823 -0.001785 -0.001766 0.258223 0.614236 0.297400 0.297306 -0.556952 -0.556919 0.162041 0.162111 -0.646186 -0.646173 -0.245515 -0.245576 0.320397 0.320439 0.246632 0.273214 0.241548 0.246625 0.241547 0.273214 0.282684 0.282683
chargesum: 0.00000
title: Mulliken charges with hydrogens summed into heavy atoms:
elementType: O O O O O O N N N N C C C C C C C C C C C C
charge: -0.168902 -0.168884 -0.192579 -0.192606 -0.203805 -0.203804 -0.126028 -0.362823 -0.001785 -0.001766 0.258223 0.614236 0.297400 0.297306 -0.236555 -0.236480 0.162041 0.162111 0.115208 0.115212 0.037169 0.037107
polarizability: 2.68071074e+02 2.26721514e-03 2.28386315e+02 1.42824470e-02 4.40655347e+00 1.02601221e+02
1716.lowfreq: -8.4194 -6.8665 -6.4190 -0.0009 -0.0008 -0.0002 26.1522 34.5491 66.9655
frequency: 26.1482 34.5207 66.9654 68.8454 75.1488 80.0702 122.9040 127.9581 165.9008 169.8523 198.7391 218.4806 237.2752 250.5026 252.6851 261.6365 284.8651 287.1983 297.0946 352.6085 366.6671 384.6595 398.8719 403.1251 436.6269 440.4344 513.5718 547.5606 587.5639 599.4758 614.8197 642.3088 663.1860 667.5169 686.1927 699.0598 699.1224 725.2628 734.1308 739.6314 821.3937 826.1952 871.0884 913.1409 929.6184 943.9214 950.9628 999.5239 1007.9891 1063.7831 1071.6772 1088.7427 1093.1344 1095.0760 1126.4845 1169.5007 1171.6311 1192.6608 1195.4304 1222.2102 1248.4071 1288.1177 1337.5188 1352.4072 1353.9950 1370.1387 1393.0235 1422.9092 1430.2686 1441.8090 1465.5401 1469.1873 1478.1594 1479.8205 1536.1211 1537.5561 1587.5685 1625.4457 1626.2211 1678.1054 2971.2914 2977.6311 3057.3859 3059.8107 3101.8579 3105.4110 3198.7035 3200.1668 3209.8179 3237.2144
redmass: 11.7852 6.3102 7.5665 7.6893 7.3131 7.9201 5.4304 9.7344 6.8138 5.7329 5.7572 7.7288 2.0195 1.7325 1.8658 1.8492 4.2517 3.5723 9.2478 5.2152 5.3765 5.4719 5.0792 6.8905 7.5392 4.6295 5.6978 4.0926 4.3427 10.3987 3.2753 3.5126 6.6455 10.2397 7.5964 9.1289 7.4014 9.0344 7.1719 6.5686 8.6352 1.9771 11.6457 1.6922 1.4043 1.3133 3.5842 3.8429 4.7025 1.5049 1.3716 1.2935 5.2098 2.3567 1.3944 3.8166 1.7350 5.6959 5.0375 5.5717 2.2974 1.7043 3.3686 8.8964 8.8748 4.7066 3.5593 3.5860 1.2293 1.4671 1.0562 1.1210 1.0725 1.1309 3.0523 8.2981 6.9401 7.0079 11.4350 11.6234 1.0341 1.0349 1.1011 1.1018 1.1001 1.1002 1.0919 1.0933 1.0898 1.1108
irintensity: 0.1612 4.6282 0.5411 0.0222 6.1532 2.0545 7.2050 8.1177 0.2161 0.9163 2.0588 4.3563 2.6407 3.4965 1.0143 2.7446 0.0989 6.6718 0.2275 3.0084 0.0070 2.6089 22.8602 1.0353 0.0156 2.0557 3.2023 2.0220 10.7314 22.2277 10.9060 0.7519 0.0348 10.2346 55.1195 2.2889 3.6958 7.8138 1.1422 11.8914 2.6243 67.0596 27.0850 23.8507 0.7671 0.2563 31.3811 8.4951 21.6847 9.4541 55.2361 0.0178 66.6330 30.2999 5.3824 170.1995 5.8976 119.5950 390.1553 15.9785 55.6690 2.0904 222.3585 154.8078 1.8522 15.5065 100.4383 6.6301 10.1770 160.1230 25.4715 23.6597 14.8577 3.8595 392.9961 61.1277 15.1519 11.3579 367.8008 2.2304 35.4690 59.8804 30.3128 3.9477 8.0859 14.4898 18.7953 0.4978 0.2362 0.1003
temp: 298.150 k
press: 1.00000 atm
elementType: 8 8 8 8 8 8 7 7 7 7 6 6 6 6 6 6 6 6 6 6 6 6 1 1 1 1 1 1 1 1 1 1
symmnumber: 1
zpe: 574955.0 jmol-1
zpe.correction: 0.218989 hartree
zpe.thermalcorrener: 0.238619 hartree
zpe.thermalcorrenthalpy: 0.239563 hartree
zpe.thermalcorrgfe: 0.170080 hartree
zpe.sumelectzpe: -1131.850803 hartree
zpe.sumelectthermal: -1131.831173 hartree
zpe.sumelectthermalent: -1131.830229 hartree
zpe.sumelectthermalfe: -1131.899712 hartree
dipole: -1.9999 0.0007 0.0015
dipole: 1.9999
quadrupole: -85.6934 -163.3733 -128.3826
quadrupole: 0.0004 0.0046 -5.9006
quadrupole: 40.1230 -37.5569 -2.5662 0.0004 0.0046 -5.9006
hfenergy: -1132.0697921 hartree
pointgroup: C01 [X(C12H10N4O6)]
dipole: -0.7867851 -0.0043142 -0.0028994 debye
polarizability: 268.0679746|0.2806935|224.3395563|0.5862413|-22.6305411|106.6510787 unknown
InChI: InChI=1S/C12H10N4O6/c1-13(2)12-8(15(19)20)5-7(6-9(12)16(21)22)14-10(17)3-4-11(14)18/h3-6H,1-2H3
charge 0 multiplicity 1
32 atoms
O  -2.934693 -2.322776 -0.499028
O  -2.961075 2.292447 0.478207
O  1.074595 -3.217196 1.556481
O  1.052249 3.227264 -1.55159
O  2.654674 -2.826253 -0.041326
O  2.627319 2.850613 0.054573
N  3.20943 0.015249 0.008121
N  -2.517292 -0.01293 -0.009337
N  1.643254 -2.457675 0.676768
N  1.623399 2.472738 -0.669195
C  1.825674 0.008438 0.004155
C  -1.087097 -0.00578 -0.004698
C  1.03945 -1.127839 0.421896
C  1.030933 1.137075 -0.418176
C  -0.366615 -1.118441 0.477344
C  -0.374606 1.113966 -0.482203
C  -3.342644 -1.164674 -0.253396
C  -3.355754 1.130505 0.229044
C  4.004901 0.706811 -1.020019
C  4.005855 -0.668602 1.040666
C  -4.765674 -0.689771 -0.155094
C  -4.773262 0.640803 0.12394
H  -0.877772 -2.016782 0.828331
H  -0.89238 2.0073 -0.836267
H  3.386804 0.934815 -1.903156
H  4.438928 1.650617 -0.640765
H  4.818055 0.028954 -1.338936
H  3.385255 -0.90207 1.92062
H  4.810965 0.016883 1.363662
H  4.450642 -1.608444 0.664029
H  -5.603037 -1.371764 -0.301375
H  -5.618378 1.314019 0.266223
