program: Gaussian 09
title: 000017435
version: EM64L-G09RevD.01
frameworkgroup: C1[X(C12H17O4PS2)]
method: RPBEPBE
basis: SDD
operation: Freq
keyword: #p
keyword: freq=noraman
keyword: PBEPBE/SDD
title: #p freq=noraman PBEPBE/SDD
converged: YES YES NO NO
title: Mulliken charges:
elementType: S S P O O O O C C C C C C C C C C C C H H H H H H H H H H H H H H H H H
charge: 0.085982 -0.257058 0.623823 -0.250452 -0.460445 -0.451465 -0.232739 -0.826465 0.558354 0.352867 -0.349018 -0.433256 -0.224408 -0.227539 -0.240400 -0.263377 -0.662117 -0.476171 -0.478195 0.351995 0.273318 0.261349 0.229855 0.231751 0.231622 0.228466 0.237913 0.251429 0.230699 0.219493 0.248116 0.237553 0.247453 0.244101 0.248793 0.238173
chargesum: 0.00000
title: Mulliken charges with hydrogens summed into heavy atoms:
elementType: S S P O O O O C C C C C C C C C C C C
charge: 0.085982 -0.257058 0.623823 -0.250452 -0.460445 -0.451465 -0.232739 -0.474470 0.558354 0.352867 -0.075700 -0.171907 0.005447 0.004212 -0.008778 0.203003 0.039504 0.256951 0.252872
polarizability: 2.21029399e+02 1.37178798e+01 2.13227900e+02 -1.13396526e+01 1.97552592e+00 1.87503001e+02
1716.lowfreq: -16.7074 -10.1725 -5.2060 0.0019 0.0025 0.0026 5.8584 13.3814 28.1764
frequency: -15.8617 11.5674 27.8967 34.9236 47.2066 53.6187 72.8168 74.6231 85.6308 100.1821 118.0030 121.1488 131.2758 136.6841 147.7509 155.8378 180.4976 204.1240 237.6779 251.0318 267.7615 276.4117 288.0822 317.4759 329.6329 364.4419 400.8376 419.3898 431.6055 495.4469 531.1578 553.9381 612.3411 640.6659 647.3958 676.0710 695.5331 702.1771 717.6681 779.5426 797.9894 812.5327 836.5014 857.2091 915.1010 940.2186 954.3174 968.4810 982.1478 989.8332 1000.3968 1011.2205 1028.6598 1084.2366 1093.9319 1108.7330 1108.8009 1120.9217 1128.2437 1129.8254 1156.5972 1173.4662 1193.7320 1199.9864 1231.4038 1275.0916 1286.8760 1341.8197 1353.5857 1384.6507 1390.8760 1421.1079 1429.7023 1443.5210 1455.4710 1456.5477 1456.6141 1462.7694 1468.3059 1469.1943 1481.4968 1484.4903 1589.8167 1608.6707 1628.1639 2977.0891 2988.6605 2994.6387 3033.8174 3039.1348 3077.7160 3090.1850 3095.6591 3096.8685 3123.5416 3125.7266 3129.4177 3134.0654 3136.2985 3145.1056 3155.2890 3167.1078
redmass: 4.1567 4.7614 5.1076 4.0730 3.4546 3.1559 3.9187 4.7056 5.6080 4.5407 2.5574 1.7197 1.2090 4.3171 2.6182 6.3202 7.0714 1.3442 5.3612 4.7798 7.0269 3.2056 6.0542 5.9237 5.6090 6.7303 2.8308 7.8894 3.7968 3.6340 15.0742 8.3797 6.4330 5.3386 10.5433 10.4048 4.0175 2.4676 2.9483 2.0762 2.1693 1.9251 4.1354 1.2499 2.6146 1.7521 11.6963 11.4200 1.4620 4.9615 1.3236 2.8698 2.2223 1.6254 2.2806 1.2698 2.4178 1.2484 1.2894 1.2925 1.6711 1.0608 1.1415 2.3571 1.2062 1.1216 1.9207 1.2645 1.3157 7.0112 1.2304 1.1209 1.1171 2.1438 1.0469 1.0672 1.0776 1.0437 1.0545 1.0530 2.2118 1.0554 6.0303 5.8747 8.6547 1.0304 1.0297 1.0360 1.0601 1.0859 1.1054 1.0974 1.1049 1.1028 1.1067 1.0850 1.1021 1.0884 1.1038 1.0929 1.0963 1.1014
irintensity: 1.3894 0.2336 0.7381 0.4753 1.6372 3.7208 2.1528 3.5854 1.0937 0.9640 1.0471 1.2213 0.3085 0.8936 1.8990 9.8340 0.7018 3.6196 19.5345 0.1298 12.6071 4.4140 4.5877 8.3552 10.3019 4.1404 0.6450 24.5446 2.4964 6.5851 145.8849 16.8539 0.1704 50.0165 79.5249 78.0624 26.6168 31.0932 41.5262 28.4548 5.8555 2.8975 2.1763 0.6622 14.6871 1.3529 242.9208 94.2276 0.3921 0.1263 0.5123 65.3643 4.9071 10.5946 121.2286 9.2968 213.0524 0.0182 1.1451 0.0972 18.9731 0.8149 7.2426 32.4568 17.1392 2.3143 120.4303 12.7606 4.6169 4.7445 23.0977 3.1005 2.3556 13.2994 14.6126 16.8658 13.4605 15.0034 22.1946 16.5195 12.5273 14.6948 3.0277 0.3831 108.1302 30.5249 49.6211 18.2554 28.7007 13.7310 20.0093 35.1691 21.4694 1.5464 25.7049 0.2771 13.2686 5.5055 10.4364 17.5394 14.0953 21.7285
temp: 298.150 k
press: 1.00000 atm
elementType: 16 16 15 8 8 8 8 6 6 6 6 6 6 6 6 6 6 6 6 1 1 1 1 1 1 1 1 1 1 1 1 1 1 1 1 1
symmnumber: 1
zpe: 715149.5 jmol-1
zpe.correction: 0.272386 hartree
zpe.thermalcorrener: 0.294756 hartree
zpe.thermalcorrenthalpy: 0.295700 hartree
zpe.thermalcorrgfe: 0.217136 hartree
zpe.sumelectzpe: -1904.256025 hartree
zpe.sumelectthermal: -1904.233655 hartree
zpe.sumelectthermalent: -1904.232711 hartree
zpe.sumelectthermalfe: -1904.311274 hartree
dipole: 0.2575 1.4581 1.4335
dipole: 2.0609
quadrupole: -117.2304 -116.8342 -143.2839
quadrupole: -3.4385 3.5595 -2.1574
quadrupole: 8.5524 8.9486 -17.5011 -3.4385 3.5595 -2.1574
hfenergy: -1904.5284107 hartree
pointgroup: C01 [X(C12H17O4P1S2)]
dipole: -0.3957019 -0.4260218 0.5651025 debye
polarizability: 231.5647234|1.2950563|203.1465848|7.6034557|-7.8034759|187.0489923 unknown
InChI: InChI=1S/C10H11O2S.C2H6O2PS/c1-2-12-10(11)9(13)8-6-4-3-5-7-8;1-3-5(6)4-2/h3-7,9H,2H2,1H3;1-2H3
charge 0 multiplicity 1
36 atoms
S  1.347554 0.430642 -1.391188
S  2.610366 -0.595734 1.987461
P  2.780013 -0.769574 -0.073895
O  -0.212301 3.137197 0.643445
O  4.242041 -0.269827 -0.839746
O  2.737226 -2.400636 -0.688905
O  -0.987514 2.59829 -1.493095
C  0.025442 0.861352 -0.03925
C  -1.092534 -0.161206 0.022229
C  -0.451302 2.266193 -0.410634
C  -1.983335 -0.35332 -1.067084
C  -1.251569 -0.940645 1.197137
C  -3.011447 -1.315434 -0.979911
C  -2.284327 -1.90227 1.281392
C  -3.165868 -2.09339 0.193184
C  -0.658974 4.55776 0.451303
C  -2.135005 4.712148 0.824815
C  5.516301 -0.862033 -0.356978
C  1.578876 -3.24015 -0.312727
H  0.580477 0.908962 0.913241
H  -1.865987 0.254249 -1.970854
H  -0.562818 -0.798449 2.037666
H  -3.694731 -1.458616 -1.824412
H  -2.399771 -2.497361 2.194149
H  -3.966825 -2.838462 0.25758
H  0.004655 5.123252 1.123949
H  -0.473553 4.840428 -0.599622
H  -2.777262 4.141665 0.133382
H  -2.318885 4.364348 1.855741
H  -2.422895 5.777965 0.762792
H  5.545852 -1.942136 -0.579603
H  5.640362 -0.684126 0.726785
H  6.292997 -0.327903 -0.923186
H  1.791752 -4.224329 -0.755215
H  0.646473 -2.823642 -0.73647
H  1.493518 -3.321507 0.786323
