program: Gaussian 09
title: 000013467
version: EM64L-G09RevD.01
frameworkgroup: C1[X(C12H26N4)]
method: RPBEPBE
basis: SDD
operation: Freq
keyword: #pfreq=noraman
keyword: PBEPBE/SDD
title: #p freq=noraman PBEPBE/SDD
converged: NO YES NO NO
title: Mulliken charges:
elementType: N N N N C C C C C C C C C C C C H H H H H H H H H H H H H H H H H H H H H H H H H H
charge: -0.208818 -0.092564 -0.634196 -0.654498 0.364128 0.369881 -0.452760 -0.454978 -0.435911 -0.392697 -0.752746 -0.750267 -0.779843 -0.756612 -0.491926 0.199391 0.204244 0.195444 0.202396 0.209275 0.208862 0.198199 0.211188 0.211053 0.233554 0.212445 0.210357 0.199182 0.221580 0.224859 0.218314 0.214406 0.222438 0.208569 0.214250 0.218962 0.206103 0.231651 0.316604 0.289524 0.306235 0.334719
chargesum: 0.00000
title: Mulliken charges with hydrogens summed into heavy atoms:
elementType: N N N N C C C C C C C C C C C C
charge: -0.208818 -0.092564 -0.028069 -0.013544 0.364128 0.369881 -0.053072 -0.043308 -0.028851 0.029545 -0.096389 -0.104645 -0.124685 -0.114831 -0.054171 0.199391
polarizability: 1.95010032e+02 -4.02118509e+00 1.45096644e+02 -1.32590529e+00 5.41792355e-01 1.42561126e+02
1716.lowfreq: -4.0066 -0.0007 -0.0006 -0.0005 3.6773 16.3033 27.3416 39.6711 51.5873
frequency: 27.0137 39.5675 51.3371 69.5873 110.0377 128.7903 169.4264 195.2022 205.1294 230.2324 240.7360 261.1781 273.0324 282.8609 305.7967 312.3919 324.8422 339.3215 362.0177 385.3343 389.7727 392.8450 399.2578 407.6369 441.3145 443.9643 470.8497 476.7478 488.1370 520.5876 563.3298 575.2775 580.7748 651.0016 681.3139 740.6900 785.6014 794.5680 830.8140 880.8921 888.4771 894.3387 898.2566 906.2315 947.3189 964.1049 971.7156 987.3500 997.4241 1000.7183 1022.3271 1034.3123 1049.7332 1071.3782 1092.2755 1099.4903 1120.1926 1133.4900 1165.5591 1181.0686 1189.1646 1193.0141 1224.9037 1227.7517 1251.9025 1260.7840 1289.8934 1305.4551 1318.5438 1331.5281 1334.6871 1344.4357 1360.7981 1366.2354 1374.2291 1384.1609 1390.6686 1404.6878 1449.9485 1456.2622 1459.9712 1461.5674 1466.0640 1467.6998 1470.8137 1475.3864 1478.2052 1484.4387 1490.3611 1491.5740 1498.7866 1601.1621 1615.9493 1672.3053 2896.1078 2967.0162 2967.6647 2969.4831 2971.6233 2974.4617 2979.2437 2981.2669 2983.9758 2989.0997 3023.8263 3030.6332 3049.2568 3050.4001 3058.5374 3062.6400 3071.3933 3076.0170 3078.4888 3083.0329 3089.2218 3096.6010 3518.0522 3545.1110 3666.1479 3690.6702
redmass: 3.9420 3.5235 3.2317 2.3124 3.3379 3.1784 2.9973 1.2376 3.3284 1.8308 1.9935 1.1493 1.1623 2.0654 1.6279 2.4142 2.8751 1.5595 1.5242 1.8190 1.7407 2.2000 2.2202 1.3418 2.0666 1.2931 2.5656 2.2937 2.5027 3.0103 1.9646 2.3320 1.8808 3.6615 4.8282 2.1194 1.9921 1.4798 1.6080 2.3161 3.2440 2.1235 1.7213 1.7670 1.7488 1.9920 1.3691 1.5810 2.6686 1.3349 1.6533 1.4884 3.2162 1.6629 1.4952 1.7688 3.3778 2.1939 2.5619 2.0774 2.4365 1.8916 1.7599 1.6759 2.0792 2.1882 1.5136 1.2492 1.1944 1.5265 1.3762 1.4776 1.2563 1.2148 1.2484 1.2042 1.2068 4.2993 1.0678 1.0605 1.0811 1.0605 1.0677 1.0580 1.0663 1.0739 1.0631 1.0665 1.0569 1.0547 1.0644 1.2217 1.2739 3.6643 1.0624 1.0599 1.0746 1.0567 1.0546 1.0363 1.0451 1.0409 1.0519 1.0621 1.1015 1.0980 1.1034 1.0983 1.0990 1.0975 1.0980 1.0984 1.0996 1.0995 1.0998 1.0979 1.0450 1.0453 1.1014 1.1023
irintensity: 4.2814 0.5400 0.3598 0.3059 2.0926 2.5526 0.5325 0.3213 1.7143 3.0060 3.7946 0.5875 0.1661 0.6460 1.0035 0.0369 22.8182 0.3479 52.5117 23.8434 24.6931 0.3794 6.3591 118.2800 13.3333 170.4810 13.5724 10.7319 2.2958 4.9007 147.9091 23.3576 85.7857 15.7134 85.9834 4.8602 1.9371 3.1435 2.5536 0.7831 9.8259 1.0407 0.7042 2.7267 3.8883 16.0905 3.1730 5.5050 11.1769 1.3491 4.8461 5.4310 9.3373 0.8451 14.9483 7.9656 23.6486 44.8304 36.9734 1.6502 11.7403 0.8209 12.9877 3.4694 41.4267 48.2719 19.9592 21.0213 4.3027 5.0488 8.6998 1.9696 28.3016 8.3523 13.1328 32.2906 12.2526 128.2081 15.0656 14.0706 7.7739 6.5599 2.8053 7.0065 2.5987 5.1592 8.5052 13.4147 0.9015 6.8471 23.7225 122.7044 87.0310 626.6105 55.3561 7.2075 30.6951 42.9976 26.9835 17.1383 34.1079 50.5880 58.5803 39.5904 26.9418 47.9421 57.1046 42.5150 36.4193 18.9108 62.7534 65.5035 44.0103 32.7062 42.9777 33.1764 18.4901 12.8803 18.0599 19.4624
temp: 298.150 k
press: 1.00000 atm
elementType: 7 7 7 7 6 6 6 6 6 6 6 6 6 6 6 6 1 1 1 1 1 1 1 1 1 1 1 1 1 1 1 1 1 1 1 1 1 1 1 1 1 1
symmnumber: 1
zpe: 985234.1 jmol-1
zpe.correction: 0.375256 hartree
zpe.thermalcorrener: 0.394106 hartree
zpe.thermalcorrenthalpy: 0.395050 hartree
zpe.thermalcorrgfe: 0.329398 hartree
zpe.sumelectzpe: -690.541251 hartree
zpe.sumelectthermal: -690.522400 hartree
zpe.sumelectthermalent: -690.521456 hartree
zpe.sumelectthermalfe: -690.587108 hartree
dipole: 1.7855 -0.1340 -1.7972
dipole: 2.5369
quadrupole: -80.3673 -102.9484 -98.0380
quadrupole: -0.0282 -5.9903 1.0254
quadrupole: 13.4173 -9.1638 -4.2534 -0.0282 -5.9903 1.0254
hfenergy: -690.9165066 hartree
pointgroup: C01 [X(C12H26N4)]
dipole: -0.6606219 0.1556813 -0.7318246 debye
polarizability: 194.8738335|1.1766559|144.8706337|4.93641|0.2913961|142.9233341 unknown
InChI: InChI=1S/C12H26N4/c1-11(2)6-5-7-12(3,4)16(11)9-8-15-10(13)14/h5-9,13-14H2,1-4H3
charge 0 multiplicity 1
42 atoms
N  0.840148 0.079316 0.141063
N  -2.893438 -0.646547 0.19952
N  -5.24603 -0.606808 0.230267
N  -4.170429 -0.003304 -1.768273
C  1.378745 1.404514 0.628906
C  1.796249 -1.069914 -0.055627
C  2.842285 1.593236 0.117301
C  2.966499 -0.633791 -1.019914
C  3.052281 0.891356 -1.232017
C  -0.512656 -0.262992 0.64279
C  1.380329 1.578448 2.184275
C  0.497854 2.533504 0.019784
C  1.065949 -2.255205 -0.746419
C  2.387592 -1.604349 1.293175
C  -1.613877 -0.293319 -0.447812
C  -4.019332 -0.429497 -0.435928
H  3.047557 2.678282 0.047242
H  3.562162 1.183006 0.854475
H  3.924268 -0.996725 -0.596515
H  2.84275 -1.135951 -1.998021
H  2.273485 1.218648 -1.945572
H  4.033685 1.158643 -1.669977
H  -0.841407 0.46953 1.401378
H  -0.529664 -1.240373 1.165026
H  1.914554 0.751628 2.68169
H  1.889519 2.524635 2.450232
H  0.358271 1.628567 2.601442
H  0.83686 3.522786 0.381506
H  0.558541 2.518005 -1.083021
H  -0.562812 2.417137 0.305312
H  0.625576 -1.929588 -1.705372
H  1.802267 -3.051803 -0.960039
H  0.269174 -2.695214 -0.121583
H  2.968668 -2.530994 1.122984
H  3.065399 -0.867784 1.758244
H  1.580109 -1.837104 2.013038
H  -1.63662 0.701437 -0.953506
H  -1.336548 -1.039343 -1.222532
H  -5.155565 -0.8754 1.209375
H  -6.037794 -0.988099 -0.287107
H  -5.011544 0.495268 -2.051448
H  -3.341363 0.095261 -2.347736
