program: Gaussian 09
title: 000008332
version: EM64L-G09RevD.01
frameworkgroup: C1[X(C15H13Cl2NO2)]
method: RPBEPBE
basis: SDD
operation: Freq
keyword: #p
keyword: freq=noraman
keyword: PBEPBE/SDD
title: #p freq=noraman PBEPBE/SDD
converged: YES YES NO NO
title: Mulliken charges:
elementType: Cl Cl O O N C C C C C C C C C C C C C C C H H H H H H H H H H H H H
charge: -0.050472 -0.046549 -0.204207 -0.207055 0.152988 -0.429527 -0.134576 0.523600 0.535022 -0.698164 -0.408340 -0.440387 -0.393772 -0.368495 -0.210121 -0.207658 -0.229971 -0.212910 -0.116750 -0.118686 0.261898 0.262178 0.242687 0.234016 0.247148 0.238607 0.243783 0.249835 0.254402 0.256709 0.258735 0.258399 0.257634
chargesum: 0.00000
title: Mulliken charges with hydrogens summed into heavy atoms:
elementType: Cl Cl O O N C C C C C C C C C C C C C C C
charge: -0.050472 -0.046549 -0.204207 -0.207055 0.152988 -0.167629 0.127602 0.523600 0.535022 0.025687 -0.169733 -0.196604 -0.143938 -0.114093 0.046588 0.051077 0.028428 0.044724 -0.116750 -0.118686
polarizability: 2.50760488e+02 3.58276648e+00 1.67858696e+02 1.38440398e+01 6.94688822e+00 1.60758052e+02
1716.lowfreq: -5.3143 -3.5463 -0.0025 -0.0020 -0.0013 11.1020 26.2445 32.3831 41.2263
frequency: 26.2102 32.3604 41.1918 45.0106 52.8475 62.3317 112.2659 122.0289 137.6498 175.8103 196.8341 211.5806 252.1024 268.5477 285.0377 297.9716 316.8305 331.5286 367.0603 407.0954 409.0319 409.8314 449.7905 494.7574 515.6643 541.8574 608.6964 623.2201 628.9709 659.9782 683.4072 686.8113 719.0722 729.1250 788.7558 801.6224 823.4694 829.5758 831.3728 846.0431 860.2165 923.9912 951.9715 956.1030 966.6888 967.8987 999.9144 1001.1958 1039.8470 1073.8108 1077.1423 1084.4235 1108.1370 1109.6885 1133.0770 1186.5304 1187.3144 1194.6914 1207.6377 1218.5336 1235.2162 1267.9671 1291.1018 1300.0149 1304.4580 1339.0477 1373.1371 1380.6139 1389.8863 1396.9618 1403.4324 1431.4337 1468.0612 1475.2605 1477.4429 1481.4148 1584.3689 1586.9883 1596.2273 1602.2480 3000.9629 3011.2586 3067.4303 3102.9373 3112.8223 3129.4580 3131.2379 3139.2060 3142.6900 3169.3806 3170.5454 3172.3894 3173.9302
redmass: 9.5540 4.2333 4.7090 6.0262 9.2443 10.9934 4.7228 8.3740 7.9686 8.7222 9.1120 1.0735 5.6167 4.3957 4.3384 6.7867 4.8800 4.8644 5.4629 3.2852 2.8973 5.8764 7.1446 3.3907 3.4428 3.4306 5.4760 7.0311 6.7174 5.6114 5.0165 6.7345 3.9439 3.6841 3.9550 2.6493 1.8581 1.2592 1.2496 2.1166 2.8937 2.0009 1.3559 1.4360 1.3773 1.3793 4.2349 4.1995 1.9482 2.8189 2.6724 2.0096 1.4118 1.9608 1.6456 1.3354 1.9485 1.2137 2.1199 2.5640 2.1059 1.9336 1.4383 1.2980 1.3508 1.5080 5.4095 5.0995 1.2717 2.6936 2.2210 4.0393 1.0623 2.0833 1.1187 2.3586 7.3895 7.0280 6.2348 6.1836 1.0353 1.0831 1.0867 1.1005 1.0998 1.0900 1.0900 1.0891 1.0889 1.0951 1.0953 1.0962 1.0961
irintensity: 0.0922 0.6267 0.4007 2.4638 1.3167 0.3867 0.1284 1.2933 0.0747 2.6871 0.3415 0.0263 0.8466 3.1020 4.4543 0.7069 0.2572 0.1991 8.0342 1.5473 0.4557 8.3191 1.1082 27.3104 30.2577 22.0300 8.7873 0.6429 0.3072 11.5564 5.6754 5.6136 2.2752 3.5866 7.6452 64.7753 55.0020 1.1146 0.0868 40.3695 3.6511 2.8264 0.2326 1.3307 0.1196 0.0808 63.8140 22.6948 9.4521 47.1963 48.6908 0.9860 7.3398 9.7428 16.6759 0.7253 2.3586 0.7489 0.0852 38.7459 25.5987 31.7496 18.9735 1.1248 3.1224 3.8122 0.8028 0.2930 22.6935 6.3274 4.6856 97.9234 10.2406 103.7346 7.3408 67.1578 1.2730 1.6212 12.3961 9.3406 12.0382 3.5485 4.1406 14.5350 9.5244 6.3525 8.7689 5.4837 8.1655 4.2343 4.5991 0.5441 0.4454
temp: 298.150 k
press: 1.00000 atm
elementType: 17 17 8 8 7 6 6 6 6 6 6 6 6 6 6 6 6 6 6 6 1 1 1 1 1 1 1 1 1 1 1 1 1
symmnumber: 1
zpe: 639892.6 jmol-1
zpe.correction: 0.243722 hartree
zpe.thermalcorrener: 0.262397 hartree
zpe.thermalcorrenthalpy: 0.263341 hartree
zpe.thermalcorrgfe: 0.193811 hartree
zpe.sumelectzpe: -1703.206612 hartree
zpe.sumelectthermal: -1703.187938 hartree
zpe.sumelectthermalent: -1703.186993 hartree
zpe.sumelectthermalfe: -1703.256523 hartree
dipole: 3.3769 -0.0006 0.1858
dipole: 3.3820
quadrupole: -151.2473 -143.3810 -120.5547
quadrupole: 13.0592 3.2829 -0.4899
quadrupole: -12.8529 -4.9867 17.8396 13.0592 3.2829 -0.4899
hfenergy: -1703.4503342 hartree
pointgroup: C01 [X(C15H13Cl2N1O2)]
dipole: 1.3198151 -0.0869647 -0.1447499 debye
polarizability: 248.3639703|-6.8805506|165.6402317|-18.3233245|9.2266024|165.3730335 unknown
InChI: InChI=1S/C15H13Cl2NO2/c1-10(18(19)20)15(11-2-6-13(16)7-3-11)12-4-8-14(17)9-5-12/h2-10,15H,1H3
charge 0 multiplicity 1
33 atoms
Cl -4.390217 3.318426 1.015333
Cl 5.607585 1.633776 0.508708
O  -2.166437 -3.179935 0.796801
O  -1.838995 -2.821281 -1.432535
N  -1.476043 -2.754697 -0.20147
C  0.000175 -0.738557 -0.563746
C  -0.087844 -2.147695 0.097342
C  -1.126105 0.217441 -0.142917
C  1.386723 -0.132514 -0.293516
C  0.967905 -3.143167 -0.417111
C  -1.505552 1.246971 -1.041684
C  2.364609 -0.099502 -1.318661
C  -1.772469 0.153537 1.117407
C  1.722225 0.392935 0.980859
C  -2.493852 2.194351 -0.702429
C  3.651198 0.437732 -1.087754
C  -2.767022 1.091667 1.475986
C  3.003643 0.927843 1.233743
C  -3.109977 2.102682 0.560936
C  3.951984 0.940372 0.191943
H  -0.091258 -0.909943 -1.653562
H  -0.052435 -2.084777 1.197496
H  0.832053 -4.132521 0.052455
H  0.894016 -3.257459 -1.512416
H  1.975734 -2.775496 -0.165121
H  -1.023137 1.312998 -2.0241
H  2.123784 -0.493499 -2.313201
H  -1.534172 -0.63724 1.836145
H  0.974348 0.410762 1.781268
H  -2.780549 2.982412 -1.404429
H  4.399475 0.465154 -1.884997
H  -3.268722 1.0281 2.445751
H  3.25733 1.334323 2.216979
