program: Gaussian 09
title: 000004484
version: EM64L-G09RevD.01
frameworkgroup: C1[X(C11H14NO9P)]
method: RPBEPBE
basis: SDD
operation: Freq
keyword: #p
keyword: freq=noraman
keyword: PBEPBE/SDD
title: #p freq=noraman PBEPBE/SDD
converged: YES YES NO NO
title: Mulliken charges:
elementType: P O O O O O O O O O N C C C C C C C C C C C H H H H H H H H H H H H H H
charge: 1.407063 -0.357882 -0.455800 -0.449956 -0.560459 -0.662420 -0.562279 -0.512980 -0.453923 -0.252319 -0.085315 -0.168629 -0.152181 -0.031942 -0.039011 -0.399631 -0.223041 -0.164049 0.201551 -0.173132 -0.270077 0.117394 0.254788 0.278492 0.249071 0.261842 0.283032 0.267397 0.400897 0.357747 0.287880 0.276854 0.247220 0.278451 0.418741 0.386605
chargesum: 0.00000
title: Mulliken charges with hydrogens summed into heavy atoms:
elementType: P O O O O O O O O O N C C C C C C C C C C C
charge: 1.407063 -0.357882 -0.054903 -0.092209 -0.560459 -0.243678 -0.562279 -0.512980 -0.067319 -0.252319 -0.085315 0.086160 0.126311 0.217129 0.222832 0.150798 0.064839 0.112804 0.201551 0.074087 0.008374 0.117394
polarizability: 2.51174725e+02 -1.69144756e-01 1.68554062e+02 4.02696935e+00 -1.32462123e+01 1.42325608e+02
1716.lowfreq: -0.4177 0.0003 0.0004 0.0013 6.9685 10.4897 29.4372 60.0243 69.8179
frequency: 29.4163 59.9973 69.7953 81.6005 90.0340 108.7869 143.6662 154.6736 167.2674 193.0623 206.4755 225.3967 230.5349 244.9131 259.9992 278.8941 298.8695 307.5222 315.8123 327.0875 333.1925 353.8507 377.1426 386.3169 416.6205 441.8712 477.7071 488.8770 503.6304 525.4372 559.1677 581.0848 591.9576 617.3505 640.0076 651.9409 673.9577 704.1923 709.6107 723.3587 727.7747 729.1233 758.0243 770.4674 790.6818 809.3376 858.5522 865.5149 902.1452 905.0297 954.5793 957.6999 982.6561 988.9053 995.4432 999.4529 1007.2404 1038.1709 1042.2021 1047.6708 1060.4240 1103.4592 1130.2957 1163.2108 1167.4220 1182.9751 1192.9930 1204.3487 1219.3751 1249.9887 1262.6232 1270.6691 1281.0037 1281.6235 1300.3046 1312.7431 1317.4437 1327.9018 1362.4541 1364.6104 1396.8037 1425.0430 1438.5724 1445.3512 1454.9198 1570.6262 1635.8485 1656.4170 3013.2283 3027.4011 3035.3278 3040.1035 3065.1320 3071.4528 3103.4282 3161.9198 3178.9422 3191.1779 3199.2553 3274.7485 3541.8910 3580.2465
redmass: 8.0270 9.5135 7.1005 7.4762 8.9005 6.3936 7.5448 8.0576 8.1240 7.5102 8.4741 6.7921 6.7111 6.5179 5.1581 2.4234 4.5520 2.4593 4.0260 3.6790 9.7482 6.5222 4.0212 5.1572 4.4181 3.5569 6.1863 6.2719 6.3914 2.7887 3.1513 2.0081 4.0618 5.4254 7.2770 7.0448 3.1100 1.6629 1.6350 3.0124 4.1297 4.0301 5.7009 4.8453 4.3208 1.6539 3.9160 3.4533 1.6226 3.4403 3.4014 5.0287 2.8570 1.5459 4.3941 3.6856 4.0677 2.6917 2.3834 2.9749 2.0709 2.3468 1.8664 1.3622 1.5404 1.1416 1.3343 2.0196 1.0888 1.3277 1.2495 1.3318 1.8571 1.2277 1.3909 1.3055 1.5543 2.7199 1.4457 1.2672 1.5346 1.2489 2.5183 1.8721 1.0825 6.4012 7.3084 7.4565 1.0852 1.0734 1.0874 1.0720 1.0872 1.0894 1.1084 1.0891 1.0937 1.0983 1.0696 1.0653 1.0643 1.0666
irintensity: 0.2040 1.0467 3.7432 2.2165 3.7022 1.6313 3.4371 6.7684 9.7118 6.2566 10.5973 4.1174 20.7664 2.2375 4.4015 23.9616 22.2233 92.2807 44.1151 3.4605 15.6179 46.4491 34.6742 9.0431 12.9736 13.6210 11.6393 75.2881 7.9575 17.9288 18.2299 152.3509 54.6445 46.0053 246.6166 116.5776 12.9453 102.1485 118.1281 25.0350 80.7591 196.1125 38.2678 12.2565 115.1256 44.8503 79.0597 38.4238 6.1963 69.4208 75.5331 140.9161 61.6349 26.0597 333.8195 10.0953 18.7382 35.3300 97.3053 143.2807 4.4081 11.1708 90.6375 145.2531 187.3290 0.8134 55.1841 58.5194 6.4622 26.6720 59.8632 10.7379 25.1913 3.7694 3.5387 25.2250 6.2197 91.8198 25.2986 9.7130 21.2783 68.3457 65.5191 28.4785 17.7411 15.4433 30.4517 589.8766 20.1237 21.1464 14.8093 66.7219 11.1670 11.2004 1.3992 0.9125 0.7529 4.4725 255.0175 233.9516 56.8686 18.6903
temp: 298.150 k
press: 1.00000 atm
elementType: 15 8 8 8 8 8 8 8 8 8 7 6 6 6 6 6 6 6 6 6 6 6 1 1 1 1 1 1 1 1 1 1 1 1 1 1
symmnumber: 1
zpe: 681545.2 jmol-1
zpe.correction: 0.259587 hartree
zpe.thermalcorrener: 0.279978 hartree
zpe.thermalcorrenthalpy: 0.280922 hartree
zpe.thermalcorrgfe: 0.211577 hartree
zpe.sumelectzpe: -1498.849367 hartree
zpe.sumelectthermal: -1498.828977 hartree
zpe.sumelectthermalent: -1498.828033 hartree
zpe.sumelectthermalfe: -1498.897378 hartree
dipole: -1.8638 9.7303 -0.6926
dipole: 9.9314
quadrupole: -134.8693 -149.0307 -135.4085
quadrupole: -12.5953 -2.9310 -1.7616
quadrupole: 4.9002 -9.2612 4.3610 -12.5953 -2.9310 -1.7616
hfenergy: -1499.1089543 hartree
pointgroup: C01 [X(C11H14N1O9P1)]
dipole: 0.2665387 3.8935462 0.1903357 debye
polarizability: 245.2069373|-19.8398408|176.8557123|6.5051138|-11.516555|139.991746 unknown
InChI: InChI=1S/C11H14NO9P/c13-8-6-4-19-22(17,18)21-7-2-1-5(11(15)16)3-12(7)10(20-6)9(8)14/h1-3,6-10,13-15,17H,4H2
charge 0 multiplicity 1
36 atoms
P  -2.071189 -1.945162 -0.723959
O  -0.912042 0.935786 -1.281642
O  -2.093002 1.248297 1.776839
O  0.219096 3.58342 0.053967
O  -2.908375 -0.554551 0.050313
O  -1.801105 -1.375404 -2.321615
O  -2.905198 -3.276487 -0.653424
O  -0.536659 -1.981965 0.056656
O  4.739497 -0.82589 -1.366896
O  5.1281 -2.352214 0.348447
N  0.936508 0.041965 0.003969
C  -1.725116 2.13356 0.675402
C  -0.17682 2.275354 0.59017
C  -2.123548 1.633083 -0.740836
C  0.293932 1.266047 -0.494483
C  -3.279237 0.621772 -0.773482
C  2.221717 -0.259623 -0.42374
C  0.212657 -0.860776 0.882413
C  2.975872 -1.235204 0.209181
C  1.115469 -1.674224 1.739794
C  2.41819 -1.897921 1.37379
C  4.34967 -1.546106 -0.218164
H  -2.181105 3.120528 0.877675
H  0.276455 2.075346 1.578421
H  -2.338692 2.494192 -1.40086
H  1.013899 1.780633 -1.152802
H  -3.511666 0.30825 -1.805107
H  -4.182024 1.047665 -0.304066
H  -2.519916 0.410632 1.408571
H  0.067567 4.283745 0.736813
H  2.628721 0.330846 -1.248233
H  -0.573025 -0.314517 1.427959
H  0.669526 -2.147841 2.616999
H  3.071317 -2.559241 1.951199
H  -1.2467 -0.532132 -2.303534
H  5.670423 -1.084062 -1.600336
