program: Gaussian 09
title: 000002639
version: EM64L-G09RevD.01
frameworkgroup: C1[X(C19H17N9O5S2)]
method: RPBEPBE
basis: SDD
operation: Freq
keyword: #p
keyword: freq=noraman
keyword: PBEPBE/SDD
title: #p freq=noraman PBEPBE/SDD
converged: YES YES NO NO
title: Mulliken charges:
elementType: S S O O O O O N N N N N N N N N C C C C C C C C C C C C C C C C C C C H H H H H H H H H H H H H H H H H
charge: 0.234234 0.402704 -0.132442 -0.276840 -0.398179 -0.245611 -0.222585 -0.173346 -0.390652 -0.119658 -0.251376 0.023342 0.067260 -0.014955 -0.557818 -0.546176 -0.459532 -0.182287 0.114857 0.187321 0.328388 -0.807367 -0.620603 0.062240 0.196788 0.516763 -0.136380 -0.223346 -0.103025 -0.254857 -0.177388 0.229828 -0.292887 -0.206187 -0.484879 0.311394 0.306803 0.268070 0.231884 0.395719 0.323090 0.214390 0.383394 0.295897 0.267444 0.258807 0.266691 0.235974 0.224382 0.241168 0.349934 0.339608
chargesum: 0.00000
title: Mulliken charges with hydrogens summed into heavy atoms:
elementType: S S O O O O O N N N N N N N N N C C C C C C C C C C C C C C C C C C C
charge: 0.234234 0.402704 -0.132442 -0.276840 -0.398179 -0.245611 -0.222585 -0.173346 0.005067 -0.119658 -0.251376 0.023342 0.067260 -0.014955 -0.557818 0.143366 -0.148138 0.124516 0.114857 0.187321 0.328388 -0.307413 -0.083122 0.062240 0.196788 0.516763 0.247014 0.072551 -0.103025 0.012587 0.081419 0.229828 -0.026196 -0.206187 0.216646
polarizability: 5.84236321e+02 -6.74927934e+01 3.72543032e+02 -1.28381210e+02 2.68991898e+01 3.08177533e+02
1716.lowfreq: -5.5633 -2.6069 0.0008 0.0011 0.0016 2.4650 7.4973 10.9933 17.8192
frequency: 7.3797 10.9072 17.7876 23.7789 35.5640 40.5428 45.0648 49.1431 57.3193 72.5890 74.5355 86.1693 101.6805 111.6658 116.8708 129.9505 130.5673 147.8694 171.2533 176.1532 182.2261 190.9539 218.5383 219.4028 242.1986 248.6226 264.1277 277.7962 286.7458 294.8456 301.8832 318.4725 347.7584 350.1769 362.4698 377.1957 378.4197 402.4629 408.9013 410.3443 454.7804 470.2307 490.5983 491.3345 508.6753 539.0234 557.4899 560.9531 562.8611 571.0042 578.3523 600.9621 628.3958 632.9460 647.1931 654.4313 664.8319 669.7113 699.0651 711.7286 714.0300 730.7956 736.1921 743.5331 749.6125 758.1893 768.3785 781.6428 784.3538 803.5360 841.1884 858.4223 879.3591 885.6092 894.0146 908.9475 913.7676 932.2558 953.5694 957.7187 967.5842 981.4408 995.8256 1010.7596 1015.9969 1019.2135 1026.3997 1070.2729 1085.8878 1103.8593 1109.7869 1124.3806 1142.0172 1142.5942 1156.0035 1164.6440 1176.3704 1192.1795 1194.9040 1213.2440 1218.8178 1237.0036 1241.9790 1245.9082 1256.4897 1267.6571 1283.4106 1294.1960 1321.9146 1338.2986 1341.2079 1348.6129 1360.1187 1364.7191 1375.1668 1378.8683 1417.4717 1431.0073 1447.5333 1448.7396 1468.5499 1469.6692 1496.1843 1507.2412 1512.1039 1521.8315 1530.2264 1568.3502 1575.5689 1609.1903 1615.9574 1631.6722 1736.6321 2816.9414 2976.2150 2997.4259 3017.9030 3028.8581 3046.5568 3050.2013 3091.0850 3106.7515 3134.2212 3175.7018 3185.7339 3202.0678 3217.5712 3280.7492 3545.5570 3694.8092
redmass: 8.1313 7.5672 6.8230 7.1630 7.5247 9.0507 8.2041 8.1287 8.4144 7.0809 1.6988 5.0899 7.0371 5.5366 2.9221 5.9209 4.3566 5.8422 4.3533 7.2934 7.9874 7.1763 7.1692 5.0636 7.8534 8.2613 11.5615 6.3168 6.6809 6.6320 6.2608 6.3611 4.0009 5.0316 1.8681 5.2148 2.4194 4.9208 4.2469 4.8611 5.0516 4.0977 2.6654 2.0003 3.8054 6.7379 5.5354 7.0516 7.7110 4.1399 4.2338 5.1895 7.6607 5.8269 8.5241 7.6442 9.4955 8.9920 8.0694 7.6608 7.4437 4.3013 5.4355 8.3263 6.5909 5.8333 4.1510 1.7835 1.3329 6.4668 1.2382 2.0336 4.4289 6.6731 5.3683 3.5454 1.3342 3.5439 2.6703 1.3579 6.4757 2.4856 4.3855 2.6866 3.3207 3.9115 2.4248 2.3060 2.5412 2.5579 1.2510 1.5211 1.5211 1.4145 1.5979 1.5857 1.6795 2.8334 1.4362 2.1240 3.0209 2.4507 2.5010 1.2709 3.6336 2.6180 2.0070 2.1372 1.5520 6.8640 1.5601 9.9189 2.4882 3.2764 4.5035 2.4235 1.1485 1.1226 1.0522 2.0443 1.0566 1.6660 5.3495 4.3496 8.6302 3.4745 1.7666 2.5897 7.5250 6.6239 4.9176 1.7267 12.8226 1.1262 1.0608 1.0284 1.0620 1.0837 1.1000 1.0889 1.1025 1.1057 1.1042 1.0891 1.0928 1.1004 1.0847 1.1020 1.0457 1.1044
irintensity: 3.1479 0.6431 4.3875 2.7025 1.4587 2.3980 0.1894 3.2274 1.6694 1.4405 1.2502 1.4441 4.0201 1.0883 2.1546 3.2935 1.7025 7.1282 0.7587 0.8973 8.6050 6.8650 7.4049 8.6122 2.8148 3.1526 7.1819 12.7825 22.3739 0.1591 2.3485 7.1909 6.2567 1.5118 5.7080 6.4811 26.2022 5.7243 2.9069 24.0610 25.7885 3.3585 112.6867 150.5780 25.6738 8.0985 37.1317 0.8921 1.1201 5.7730 1.4394 24.3651 10.2907 24.5170 12.7097 0.9388 15.2948 25.9315 13.7619 54.7242 24.3964 0.8733 3.3507 69.5033 30.6289 20.5904 8.3150 2.8858 135.9097 10.5992 78.7383 5.3009 24.4214 54.5299 3.0898 14.3169 1.7102 46.1203 77.2985 1.5318 206.4753 6.4295 35.6031 81.7671 160.9539 9.8589 4.2986 8.7235 41.0074 1.7366 0.7187 5.7673 6.8410 7.5705 1.7491 30.8747 24.2203 14.7939 1.5197 34.4824 244.2742 83.5940 18.4005 27.5852 86.8805 13.6701 70.6602 51.3107 85.2558 283.2056 15.4721 67.4827 20.3698 18.9453 155.4969 122.0589 1.1896 7.4869 11.6257 61.9935 32.4152 23.8813 83.4850 173.0231 30.4462 120.6289 619.9717 164.6085 169.9041 26.4600 259.1333 346.8615 444.5462 2.6592 14.9904 84.2165 23.4281 33.4467 7.1385 33.5664 0.5785 29.5241 14.6801 1.3154 10.8112 1.1204 514.6523 10.0325 150.8763 56.2700
temp: 298.150 k
press: 1.00000 atm
elementType: 16 16 8 8 8 8 8 7 7 7 7 7 7 7 7 7 6 6 6 6 6 6 6 6 6 6 6 6 6 6 6 6 6 6 6 1 1 1 1 1 1 1 1 1 1 1 1 1 1 1 1 1
symmnumber: 1
zpe: 946868.4 jmol-1
zpe.correction: 0.360643 hartree
zpe.thermalcorrener: 0.393203 hartree
zpe.thermalcorrenthalpy: 0.394148 hartree
zpe.thermalcorrgfe: 0.290743 hartree
zpe.sumelectzpe: -2396.561875 hartree
zpe.sumelectthermal: -2396.529314 hartree
zpe.sumelectthermalent: -2396.528370 hartree
zpe.sumelectthermalfe: -2396.631774 hartree
dipole: -4.4123 4.5441 12.4256
dipole: 13.9468
quadrupole: -65.1984 -218.8052 -235.4972
quadrupole: -60.2279 -0.5825 -15.1129
quadrupole: 107.9685 -45.6382 -62.3303 -60.2279 -0.5825 -15.1129
hfenergy: -2396.9225177 hartree
pointgroup: C01 [X(C19H17N9O5S2)]
dipole: -2.2281593 3.6387025 3.450103 debye
polarizability: 611.3988774|-93.6733115|357.0390588|-73.6956891|-22.2989522|296.5189492 unknown
InChI: InChI=1S/C19H17N9O5S2/c1-33-24-11(14-23-19(20)35-25-14)15(29)22-12-16(30)28-13(18(31)32)9(8-34-17(12)28)7-26-5-6-27-10(26)3-2-4-21-27/h2-6,12,17,22H,7-8,20H2,1H3
charge 0 multiplicity 1
52 atoms
S  -1.025254 1.438843 -2.359531
S  4.926939 -0.975204 2.680157
O  1.390647 -2.554916 -1.008796
O  -1.603834 -3.644699 -1.885232
O  -2.536199 -3.313481 0.226638
O  3.471874 1.664662 -2.493654
O  6.417884 3.077173 0.126662
N  -0.436885 -0.911033 -0.953971
N  2.563953 0.48174 -0.695884
N  -4.928882 -0.9724 0.035734
N  -6.203523 -0.256443 1.720298
N  -7.134508 0.464523 2.450752
N  5.335038 2.71489 -0.735821
N  6.472589 0.407804 0.999686
N  4.154915 0.083577 1.444292
N  7.756978 -0.921023 2.508907
C  -0.012567 0.511483 -1.071628
C  1.427411 0.011993 -1.444891
C  0.892629 -1.430275 -1.126389
C  -1.739346 -1.404366 -1.002222
C  -2.798031 -0.538124 -1.224751
C  -2.647703 0.953327 -1.455611
C  -4.194854 -1.107443 -1.28403
C  -1.950951 -2.932831 -0.883275
C  3.546832 1.251839 -1.300283
C  -5.872931 -0.031527 0.362625
C  -4.656679 -1.777802 1.154365
C  -5.44964 -1.327087 2.204801
C  4.735642 1.584218 -0.395572
C  -6.523612 1.006954 -0.338764
C  -7.481919 1.747492 0.368542
C  5.135172 0.682395 0.720648
C  -7.745233 1.439115 1.741064
C  6.57628 -0.454513 2.008035
C  7.000479 4.339376 -0.381761
H  -0.072264 1.055231 -0.114585
H  1.627979 0.143996 -2.524544
H  -2.656196 1.546175 -0.520244
H  -3.450669 1.339835 -2.109868
H  2.743201 0.159441 0.276582
H  -4.185405 -2.184903 -1.514348
H  -4.815564 -0.597681 -2.043553
H  -3.854496 -2.545448 1.053131
H  -5.545074 -1.671058 3.228693
H  -6.282728 1.214688 -1.383234
H  -8.028114 2.561701 -0.112007
H  -8.483502 2.003738 2.316682
H  6.234682 5.133103 -0.40277
H  7.798383 4.582416 0.337057
H  7.415391 4.187252 -1.39192
H  8.62249 -0.58834 2.086274
H  7.796774 -1.614988 3.249916
