program: Gaussian 09
title: 000001896
version: EM64L-G09RevD.01
frameworkgroup: C1[X(C11H19N5O11P2)]
method: RPBEPBE
basis: SDD
operation: Freq
keyword: #p
keyword: freq=noraman
keyword: PBEPBE/SDD
title: #p freq=noraman PBEPBE/SDD
converged: NO YES NO NO
title: Mulliken charges:
elementType: P P O O O O O O O O O O O N N N N N C C C C C C C C C C C H H H H H H H H H H H H H H H H H H H
charge: 1.514674 1.429597 -0.307918 -0.416069 -0.438735 -0.608959 -0.281369 -0.751198 -0.635760 -0.645082 -0.682031 -0.646807 -0.545252 -0.223815 -0.152023 -0.450347 -0.042262 -0.645828 -0.201040 -0.158874 -0.170835 0.004291 -0.333937 0.349279 -0.352134 0.044906 -0.658619 0.012152 0.129125 0.298522 0.268612 0.250975 0.286951 0.217699 0.231274 0.254425 0.253573 0.351712 0.358399 0.412816 0.214231 0.197304 0.306722 0.340030 0.359893 0.408201 0.438198 0.415333
chargesum: 0.00000
title: Mulliken charges with hydrogens summed into heavy atoms:
elementType: P P O O O O O O O O O O O N N N N N C C C C C C C C C C C
charge: 1.514674 1.429597 -0.307918 -0.064357 -0.080336 -0.608959 -0.281369 -0.751198 -0.227559 -0.645082 -0.243833 -0.231473 -0.545252 -0.223815 -0.152023 -0.037531 -0.042262 0.054095 0.097482 0.109738 0.080140 0.291242 0.115036 0.349279 0.155864 0.044906 0.059638 0.012152 0.129125
polarizability: 7.29341108e+02 -1.83212353e+01 2.62560654e+02 -3.80493023e+01 -5.14903784e-01 1.74230563e+02
1716.lowfreq: -29.3969 -6.0569 -4.8884 -0.0009 0.0008 0.0019 1.1235 16.4549 23.1259
frequency: -28.5975 16.4351 22.9450 35.1555 41.3424 45.9288 52.8854 74.7099 77.5558 81.9363 91.7820 99.0625 131.9837 135.3214 148.1615 151.3533 163.1346 177.8670 183.1701 192.3151 200.2679 218.0126 231.4371 238.5195 247.1005 250.0564 267.3019 268.5456 295.4968 300.2942 314.9825 316.3755 323.9225 327.1869 331.2714 335.6794 351.6894 356.5524 386.8398 395.6370 402.9357 412.3010 454.3753 473.2353 481.0022 492.2812 500.5479 509.8521 532.0168 547.3496 578.0392 590.8754 606.4001 618.4253 635.5176 641.4226 671.0673 679.3226 686.6135 701.9695 733.6263 741.6923 751.8741 772.6333 773.6996 800.6114 831.5558 855.7865 907.0173 910.3412 931.7135 941.9256 974.9404 981.3242 992.0590 993.7998 1003.5338 1015.2941 1026.3287 1036.1468 1044.8316 1055.4140 1062.6574 1092.1686 1104.6918 1120.6621 1125.7773 1132.3408 1144.5280 1148.1602 1176.2420 1187.4152 1200.0912 1210.5155 1219.8171 1233.7163 1242.7623 1263.4420 1278.7032 1289.9453 1309.8328 1324.8165 1332.1634 1337.6493 1365.3367 1371.8473 1388.3838 1390.6891 1406.8390 1439.3296 1443.5704 1477.1640 1486.6441 1505.9851 1509.1222 1553.0740 1592.3415 1619.7478 1654.4871 2865.5873 2897.0156 2973.9620 2984.7955 2988.4730 3025.5526 3030.0447 3040.5752 3094.0000 3094.5455 3111.8887 3321.3796 3378.7128 3516.6159 3523.3868 3574.1566 3575.5219 3584.3775 3692.4082
redmass: 3.9445 9.0325 6.3918 6.3706 5.1455 7.2086 7.0384 5.9124 5.6937 6.1966 5.0541 4.8896 3.7000 3.1509 2.7996 6.6635 3.7087 5.7357 5.0075 3.2951 4.0688 5.0452 3.0549 3.8972 2.0083 2.1642 7.5621 3.7919 5.7021 6.3916 3.2383 5.7152 4.0690 4.0595 2.3687 1.9843 5.0261 7.0415 2.8388 7.0867 4.0879 1.3954 5.5594 4.6755 4.8610 1.5618 2.7016 1.1698 5.4958 5.2890 3.3877 4.8664 5.1450 1.8595 4.9293 4.9715 6.0723 11.9635 8.8550 8.6505 6.2539 9.1880 6.9457 9.8739 10.2029 3.6078 1.1462 4.1287 4.9942 6.0896 6.2576 3.7229 1.4855 2.8138 2.8605 4.4496 1.6876 2.6922 3.2006 2.6972 2.2337 3.2450 2.0576 3.0953 1.8566 1.3118 1.3524 3.3597 2.2396 1.2563 1.5810 2.2124 1.4766 1.8979 2.1765 2.0396 1.2107 1.3252 1.2984 1.3743 1.3293 1.4270 1.6074 2.3691 1.2803 1.4261 2.0819 1.5431 3.3116 1.3001 1.0902 1.1738 1.1574 1.5271 1.8681 6.2450 1.6312 2.1588 8.6937 1.0715 1.0515 1.0925 1.0845 1.0871 1.0812 1.0641 1.0799 1.1007 1.0876 1.1078 1.0828 1.0652 1.0476 1.0656 1.0665 1.0664 1.0666 1.1032
irintensity: 10.8918 1.6713 0.2406 3.3941 24.6808 0.6242 1.8853 16.9893 5.4477 3.3205 2.8246 7.1476 1.4173 12.9071 58.7776 28.1755 88.4638 8.3398 27.1426 26.8328 3.7998 43.9010 5.9184 6.1326 10.4789 15.5318 3.6350 3.5525 17.4059 21.3739 10.8529 40.0844 41.6859 40.2586 15.1340 126.5654 11.7963 25.2011 59.4583 8.2754 4.6014 47.9043 46.2446 6.8856 153.2347 100.0991 99.7203 203.7741 4.6396 18.0777 56.2564 13.1109 25.2107 268.3507 0.5730 4.8510 0.7060 860.1703 11.1633 302.6453 18.3469 18.3633 42.1421 141.7007 515.7986 33.9330 98.7360 62.0653 90.7316 41.0299 35.0310 43.9162 61.6737 1.6385 4.4531 124.1731 1.5825 81.4801 9.3561 14.9150 1.1013 189.2092 17.5022 16.2919 44.2754 326.4552 36.2416 139.6745 5.8879 21.7486 25.3049 5.9610 44.5812 67.4256 12.9700 76.0603 6.4138 5.0633 18.2824 59.9579 30.3669 39.4669 26.0425 109.4626 3.7323 23.0122 65.6263 15.4959 116.8078 131.7382 14.4435 140.8907 45.2382 131.7355 48.7665 869.1248 62.7257 405.7781 28.6395 171.7104 320.0289 75.4869 20.1515 46.5537 72.4499 11.5565 10.0846 6.2389 5.8841 3.4819 48.8452 178.0160 18.1791 3.8880 17.4792 126.7900 79.3074 81.4803
temp: 298.150 k
press: 1.00000 atm
elementType: 15 15 8 8 8 8 8 8 8 8 8 8 8 7 7 7 7 7 6 6 6 6 6 6 6 6 6 6 6 1 1 1 1 1 1 1 1 1 1 1 1 1 1 1 1 1 1 1
symmnumber: 1
zpe: 892339.8 jmol-1
zpe.correction: 0.339874 hartree
zpe.thermalcorrener: 0.370773 hartree
zpe.thermalcorrenthalpy: 0.371718 hartree
zpe.thermalcorrgfe: 0.277185 hartree
zpe.sumelectzpe: -2211.959017 hartree
zpe.sumelectthermal: -2211.928118 hartree
zpe.sumelectthermalent: -2211.927174 hartree
zpe.sumelectthermalfe: -2212.021706 hartree
dipole: -3.0682 8.3381 -0.2111
dipole: 8.8872
quadrupole: -259.8423 -180.3609 -177.4579
quadrupole: 47.1225 0.6749 -8.5922
quadrupole: -53.9553 25.5261 28.4291 47.1225 0.6749 -8.5922
hfenergy: -2212.2988913 hartree
pointgroup: C01 [X(C11H19N5O11P2)]
dipole: -1.1842599 3.2037098 -0.7478427 debye
polarizability: 731.6306176|-17.8266055|259.2913565|13.1666172|-17.3762969|175.210351 unknown
InChI: InChI=1S/C11H19N5O11P2/c1-15-3-16(8-5(15)9(19)14-11(12)13-8)10-7(18)6(17)4(26-10)2-25-29(23,24)27-28(20,21)22/h4,6-7,10,13,17-18,20-21,23H,2-3,12H2,1H3
charge 0 multiplicity 1
48 atoms
P  -2.842823 -0.38644 0.659834
P  -5.574693 -0.745304 -0.885483
O  -0.282772 1.30284 0.632764
O  0.508493 4.046611 1.401459
O  0.933165 3.032245 -2.153125
O  -2.74174 0.53673 -0.818971
O  5.00006 -2.810897 0.540793
O  -4.295529 -1.190737 0.291568
O  -3.214407 0.837812 1.800056
O  -1.684309 -1.391585 1.065873
O  -4.668189 -0.727887 -2.339893
O  -6.398823 -2.216087 -1.014619
O  -6.460101 0.487106 -0.476052
N  2.046418 0.856826 0.163074
N  4.281034 0.132289 -0.041891
N  1.136204 -1.345206 0.916223
N  2.713652 -3.17769 1.019599
N  0.433048 -3.510804 1.514589
C  1.146355 1.722813 0.888318
C  1.102976 3.183347 0.382926
C  0.193517 3.117959 -0.894895
C  -0.579096 1.776678 -0.747938
C  3.384339 1.270394 -0.384129
C  2.157023 -0.518282 0.490538
C  -2.090387 1.881292 -0.87036
C  3.453855 -0.965348 0.329757
C  5.490169 -0.054471 -0.851888
C  3.80936 -2.359233 0.626757
C  1.480362 -2.691007 1.142777
H  1.237872 1.65494 1.991384
H  2.085964 3.628688 0.168378
H  -0.469933 4.007545 -0.876123
H  -0.162368 1.064944 -1.483736
H  3.733656 2.213217 0.082042
H  3.323081 1.419874 -1.489731
H  -2.376449 2.26615 -1.862673
H  -2.527088 2.510332 -0.074611
H  -0.30283 3.598971 1.760049
H  1.282083 3.925352 -2.400116
H  0.148139 -1.04467 0.961007
H  6.197276 0.778079 -0.684487
H  5.261759 -0.11361 -1.942239
H  5.959844 -1.001053 -0.537653
H  0.655765 -4.486498 1.689783
H  -0.531069 -3.177008 1.508359
H  -2.764892 0.728902 2.677524
H  -3.836995 -0.172338 -2.248089
H  -5.886172 -2.963281 -1.418828
