program: Gaussian 09
title: 000180523
version: EM64L-G09RevD.01
frameworkgroup: C1[X(C15H30O3)]
method: RPBEPBE
basis: SDD
operation: Freq
keyword: #pfreq=noraman
keyword: PBEPBE/SDD
title: #p freq=noraman PBEPBE/SDD
converged: YES YES NO NO
title: Mulliken charges:
elementType: O O O C C C C C C C C C C C C C C C H H H H H H H H H H H H H H H H H H H H H H H H H H H H H H
charge: -0.471544 -0.256182 -0.272010 -0.388245 -0.385165 -0.385039 -0.384846 -0.380812 -0.381693 -0.406766 -0.372792 -0.044770 -0.353191 -0.536292 -0.356719 -0.696985 0.256995 -0.504878 0.191787 0.198483 0.190861 0.194261 0.197518 0.185384 0.194051 0.191960 0.180204 0.242640 0.190608 0.192162 0.209981 0.190859 0.189703 0.188776 0.191238 0.187726 0.186918 0.260526 0.246160 0.194888 0.194499 0.209654 0.214611 0.209409 0.368438 0.237500 0.244947 0.245180
chargesum: 0.00000
title: Mulliken charges with hydrogens summed into heavy atoms:
elementType: O O O C C C C C C C C C C C C C C C
charge: -0.103106 -0.256182 -0.272010 0.002026 -0.000043 -0.002137 0.001165 0.042033 0.001077 -0.005926 0.005687 0.146468 0.021453 -0.029606 0.032667 -0.063310 0.256995 0.222750
polarizability: 2.42255831e+02 2.32606961e+00 1.50989614e+02 4.67158376e+00 -9.15401691e-01 1.36585113e+02
1716.lowfreq: -24.3237 -6.5101 -0.0015 0.0005 0.0013 2.9217 5.2591 11.4873 22.2062
frequency: -12.7043 8.5344 21.6045 28.3473 39.6656 53.9679 58.7306 67.9823 88.4248 94.7329 97.5014 110.5803 125.2400 129.6046 135.2943 148.4383 151.2217 163.0583 193.4902 227.2859 231.8795 267.7293 290.0757 308.3340 347.8034 389.4081 398.9451 447.4554 476.9386 490.7243 519.8892 585.3871 595.2506 684.8679 717.3670 720.0074 725.9661 739.1508 764.2929 800.9381 818.1299 846.5076 862.4043 886.8355 907.8912 946.0147 957.3518 979.9811 986.0374 996.6838 1010.9506 1024.7205 1032.9691 1044.1831 1056.1589 1072.4871 1077.9693 1080.8471 1083.5236 1089.8828 1112.0119 1113.0642 1125.3932 1147.2546 1151.1858 1181.0705 1192.3094 1205.2342 1207.7365 1231.3423 1234.1154 1254.4531 1260.1845 1273.8453 1275.5482 1280.8416 1284.1278 1289.8071 1291.7749 1294.0387 1297.9807 1309.4064 1320.0876 1331.7784 1338.7785 1350.9612 1352.7030 1355.2423 1359.5365 1386.5321 1402.7766 1416.2878 1422.1039 1446.2270 1452.7381 1458.1266 1458.2850 1461.6212 1461.8447 1462.6477 1465.8597 1471.1307 1475.8386 1476.8279 1481.9588 1486.0166 1488.2922 1615.4597 2927.4473 2945.1572 2946.9150 2947.6472 2949.2515 2951.2481 2955.8323 2960.3503 2962.4927 2966.6901 2967.4086 2970.7057 2980.3005 2983.4844 2988.4955 2994.4819 2995.7954 3006.5040 3009.2501 3018.0339 3022.2433 3030.7855 3039.8824 3054.4494 3067.3333 3068.9373 3069.4610 3113.2488 3154.6603 3452.0469
redmass: 2.1412 3.7607 3.6716 3.6433 3.1643 4.1282 1.7645 3.5617 1.3842 2.0678 1.7709 3.2356 3.0802 1.9873 3.3949 2.3367 2.0032 3.5322 3.0652 1.1221 3.2959 4.8093 4.0681 3.7118 5.4057 3.0604 3.3983 2.3070 2.6813 3.0428 2.6943 1.1626 3.1046 5.1597 1.0587 1.0676 1.0864 1.1311 1.2054 1.3991 2.9493 2.0477 1.8770 1.8984 1.3334 4.1025 1.5676 4.7126 2.2416 2.0188 3.5537 1.1753 3.1515 3.0565 2.6212 2.7195 2.2746 2.1359 2.1796 2.6524 1.2920 1.5680 3.0705 1.5557 2.3563 1.8517 1.3349 1.4021 1.3695 1.3467 1.3326 1.2798 1.2982 1.2238 1.0253 1.1826 1.0853 1.1360 1.1626 1.1339 1.1733 1.4297 1.4842 1.2408 1.4230 1.5877 1.6662 1.6571 1.5952 1.2174 1.6521 1.1302 1.1939 1.0846 1.0501 1.0728 1.0724 1.0621 1.0743 1.0509 1.0791 1.0832 1.0446 1.0832 1.0893 1.0935 1.0937 7.8954 1.0835 1.0591 1.0586 1.0589 1.0591 1.0595 1.0597 1.0618 1.0609 1.0591 1.0618 1.0363 1.0957 1.0964 1.0980 1.0625 1.1003 1.1025 1.0294 1.1014 1.1003 1.1049 1.1045 1.1018 1.1006 1.0972 1.0993 1.1048 1.1052 1.0652
irintensity: 0.4758 0.3859 0.0511 0.3835 0.3023 0.4283 0.0822 0.6906 0.2423 0.4757 0.1517 0.5361 0.0796 0.1386 0.4913 0.5910 0.0479 1.8097 10.3039 0.0182 1.6210 8.8558 8.5375 2.3815 17.5080 2.6628 0.9642 5.5951 0.6114 2.3581 7.9132 193.8556 18.1166 2.9425 18.0317 0.1437 5.4750 0.6727 0.6991 7.4610 12.4238 0.4806 1.1580 5.3170 5.2655 18.4508 5.6203 1.1511 0.7321 11.8038 1.7174 1.8129 13.2220 8.7672 10.1342 9.9161 0.7610 0.1692 2.1592 11.0409 2.6586 71.7960 1.6070 23.1904 227.7142 1.0507 2.0899 26.6878 21.9179 10.4203 7.4983 16.1168 8.8543 13.2310 1.4119 7.3297 4.2033 3.0060 4.5858 4.1858 4.8082 39.1197 31.6717 21.8147 1.4751 3.5414 0.8131 0.3041 4.0695 11.0599 53.3874 30.6973 25.2192 7.6956 15.2687 0.0014 0.0663 0.1077 0.0169 11.8842 0.4623 0.6664 11.7046 2.1503 1.7803 4.7786 36.7493 148.7420 45.9583 4.0920 0.8571 0.6626 0.6352 2.5844 0.7456 21.1961 56.2811 78.3541 194.2168 39.4990 1.8847 2.7857 3.5358 10.3485 2.9856 2.3868 29.4539 17.2947 8.1164 0.1890 195.9800 105.9890 96.4322 23.5158 57.4284 24.4021 14.8989 80.5634
temp: 298.150 k
press: 1.00000 atm
elementType: 8 8 8 6 6 6 6 6 6 6 6 6 6 6 6 6 6 6 1 1 1 1 1 1 1 1 1 1 1 1 1 1 1 1 1 1 1 1 1 1 1 1 1 1 1 1 1 1
symmnumber: 1
zpe: 1118033.3 jmol-1
zpe.correction: 0.425836 hartree
zpe.thermalcorrener: 0.448776 hartree
zpe.thermalcorrenthalpy: 0.449720 hartree
zpe.thermalcorrgfe: 0.368917 hartree
zpe.sumelectzpe: -813.770840 hartree
zpe.sumelectthermal: -813.747900 hartree
zpe.sumelectthermalent: -813.746956 hartree
zpe.sumelectthermalfe: -813.827759 hartree
dipole: -2.2646 -2.1929 -1.1918
dipole: 3.3701
quadrupole: -85.3042 -118.6568 -113.0447
quadrupole: 10.4336 5.6748 -0.5981
quadrupole: 20.3644 -12.9882 -7.3762 10.4336 5.6748 -0.5981
hfenergy: -814.196676 hartree
pointgroup: C01 [X(C15H30O3)]
dipole: 0.8942031 -0.7123693 0.671557 debye
polarizability: 242.2922609|-0.940882|150.4923003|4.7544228|-2.7687346|137.0459969 unknown
InChI: InChI=1S/C15H30O3/c1-3-4-5-6-7-8-9-10-11-12-14(16)13-15(17)18-2/h14,16H,3-13H2,1-2H3
charge 0 multiplicity 1
48 atoms
O  3.92564 1.117989 -1.153939
O  7.498571 -0.791613 0.44213
O  6.613359 1.217917 -0.312163
C  -1.229582 0.297011 0.081851
C  -2.547833 -0.474323 -0.152157
C  0.033321 -0.555087 -0.175794
C  -3.811248 0.369764 0.129011
C  1.348307 0.22554 0.040633
C  -5.129291 -0.401389 -0.107457
C  2.605125 -0.646092 -0.167291
C  -6.393096 0.439027 0.183607
C  3.91158 0.153247 -0.046686
C  -7.711113 -0.333013 -0.05037
C  5.155026 -0.772411 -0.108626
C  -8.974854 0.507559 0.242729
C  -10.286862 -0.272948 0.011115
C  6.45599 0.003071 -0.01604
C  8.829506 -0.134478 0.530094
H  -1.207899 0.676582 1.125144
H  -1.206592 1.192275 -0.573995
H  -2.561984 -1.378907 0.491991
H  -2.576838 -0.839856 -1.200161
H  0.006454 -0.944687 -1.215076
H  0.014484 -1.444511 0.48996
H  -3.796789 1.275849 -0.512562
H  -3.782728 0.732711 1.178025
H  1.359075 0.64585 1.068746
H  1.398339 1.084922 -0.654073
H  -5.140248 -1.310991 0.529447
H  -5.160889 -0.758812 -1.158209
H  2.575457 -1.105457 -1.175933
H  2.614675 -1.473268 0.572363
H  -6.383195 1.348116 -0.453949
H  -6.360478 0.797286 1.234138
H  3.922614 0.695852 0.926942
H  -7.746016 -0.690581 -1.101029
H  -7.722057 -1.242521 0.58667
H  5.148282 -1.311851 -1.077171
H  5.132198 -1.535128 0.689752
H  -8.964972 1.414246 -0.396485
H  -8.937286 0.867439 1.291421
H  -10.360547 -0.621187 -1.036614
H  -11.174309 0.351758 0.222796
H  -10.337753 -1.164952 0.663991
H  4.781504 1.62582 -1.08599
H  9.504969 -0.922335 0.890203
H  8.788616 0.711418 1.236021
H  9.137268 0.234741 -0.46221
