program: Gaussian 09
title: 000180467
version: EM64L-G09RevD.01
frameworkgroup: C1[X(C14H9ClO3)]
method: RPBEPBE
basis: SDD
operation: Freq
keyword: #p
keyword: freq=noraman
keyword: PBEPBE/SDD
title: #p freq=noraman PBEPBE/SDD
converged: YES YES NO NO
title: Mulliken charges:
elementType: Cl O O O C C C C C C C C C C C C C C H H H H H H H H H
charge: -0.046040 -0.268032 -0.267712 -0.255403 0.054227 0.180944 0.202619 0.115670 0.179767 0.234264 -0.393898 -0.316728 -0.334713 -0.382295 -0.187943 -0.139903 -0.192595 -0.521336 0.268273 0.303436 0.268931 0.262540 0.239561 0.263980 0.290672 0.209979 0.231733
chargesum: 0.00000
title: Mulliken charges with hydrogens summed into heavy atoms:
elementType: Cl O O O C C C C C C C C C C C C C C
charge: -0.046040 -0.268032 -0.267712 -0.255403 0.054227 0.180944 0.202619 0.115670 0.179767 0.234264 -0.125625 -0.013292 -0.065782 -0.119755 0.051618 -0.139903 0.071385 0.211049
polarizability: 2.79998151e+02 5.86285199e+00 1.93272676e+02 3.62701009e+00 -4.89601657e+00 7.17975860e+01
1716.lowfreq: -7.6037 -0.0015 -0.0007 0.0014 3.2390 6.4987 40.3951 59.0076 109.6804
frequency: 40.3844 59.0026 109.6715 119.6681 136.6524 143.7600 157.3273 224.0111 243.2514 258.0545 279.1913 312.0274 338.4878 349.4427 395.2524 429.3777 447.1971 472.9872 493.4169 505.6006 531.9820 553.8654 603.2158 610.4079 656.1878 664.0776 677.5628 714.7962 768.4521 785.7546 813.5983 821.8098 832.2008 891.3618 911.3920 922.5469 927.2842 956.3516 979.2888 1021.2967 1061.9795 1069.6094 1106.5750 1108.1945 1146.9824 1157.7877 1169.9765 1200.8849 1222.4486 1241.4410 1244.3621 1281.2010 1370.9314 1398.8095 1409.8182 1413.6790 1414.8785 1445.3028 1451.9339 1458.7937 1481.7070 1546.2338 1563.2446 1587.5098 1603.8198 1620.6899 2983.8858 3097.6990 3130.8693 3150.8247 3163.5092 3171.5954 3175.5879 3182.4096 3185.6468
redmass: 7.0766 4.7520 2.1626 5.5251 8.4005 1.7222 5.6130 6.1684 5.5118 3.4600 9.7469 6.0968 7.2270 6.2371 6.9044 3.7167 5.8979 6.2112 5.2920 5.9590 4.0790 7.5662 6.9923 4.9233 7.6816 5.0797 6.2768 3.1870 6.1015 2.1302 2.7909 1.5034 6.7477 1.4222 8.4752 1.5218 5.4575 1.3420 1.3259 5.5192 1.8625 1.9555 1.2535 2.1554 1.4043 1.7196 1.2251 2.3774 3.7662 2.7757 1.7570 3.3642 6.9553 9.5577 2.0175 3.1886 2.6928 1.2631 2.7009 1.6197 1.0812 7.2164 7.0489 8.6770 7.4725 8.1576 1.0322 1.0996 1.1054 1.0878 1.0888 1.0926 1.0924 1.0980 1.0990
irintensity: 1.2659 0.3503 6.3610 1.1015 0.1031 1.2503 3.1165 0.2618 4.1055 3.2714 2.0187 2.1385 2.4985 4.4591 3.8210 1.5898 9.5337 1.0107 6.5109 14.1172 12.9881 2.6061 24.3618 4.0892 2.2496 12.1170 33.0295 15.0490 6.9350 24.1542 48.0966 63.0261 8.4275 2.3183 28.5919 11.4905 10.6485 1.3571 1.9726 110.4663 5.6141 10.2818 10.7004 39.3166 0.9471 22.1286 3.4474 2.1774 28.5996 95.4724 3.8730 229.4481 5.3109 7.6039 3.5173 73.4888 139.4148 105.0468 155.1157 90.4201 59.3418 108.2258 103.1141 110.1470 112.9261 46.8074 59.7435 32.3740 10.7455 9.6083 0.6662 4.9868 3.3337 2.6271 6.0870
temp: 298.150 k
press: 1.00000 atm
elementType: 17 8 8 8 6 6 6 6 6 6 6 6 6 6 6 6 6 6 1 1 1 1 1 1 1 1 1
symmnumber: 1
zpe: 503502.3 jmol-1
zpe.correction: 0.191774 hartree
zpe.thermalcorrener: 0.206498 hartree
zpe.thermalcorrenthalpy: 0.207442 hartree
zpe.thermalcorrgfe: 0.149582 hartree
zpe.sumelectzpe: -1223.365423 hartree
zpe.sumelectthermal: -1223.350699 hartree
zpe.sumelectthermalent: -1223.349754 hartree
zpe.sumelectthermalfe: -1223.407615 hartree
dipole: -1.3912 -2.9438 2.0607
dipole: 3.8533
quadrupole: -104.5000 -102.7015 -113.0777
quadrupole: -2.3047 -2.5121 4.8761
quadrupole: 2.2597 4.0582 -6.3180 -2.3047 -2.5121 4.8761
hfenergy: -1223.5571965 hartree
pointgroup: C01 [X(C14H9Cl1O3)]
dipole: -0.4617245 -1.2215477 0.7699813 debye
polarizability: 278.3137752|12.718125|194.9610188|7.1902401|-0.8952845|71.793619 unknown
InChI: InChI=1S/C14H9ClO3/c1-17-11-3-2-4-12-13(11)14(16)9-7-8(15)5-6-10(9)18-12/h2-7H,1H3
charge 0 multiplicity 1
27 atoms
Cl 5.080169 1.481087 0.09745
O  0.147167 -1.936865 0.115262
O  -3.199096 1.783012 -0.039571
O  -0.266906 2.17941 -0.521239
C  -1.359686 0.045856 -0.05139
C  1.143181 0.300648 -0.040629
C  -1.140249 -1.373856 -0.002744
C  -0.190034 0.944559 -0.213069
C  1.266313 -1.099428 0.13295
C  -2.740248 0.471707 -0.089685
C  -2.173696 -2.322846 -0.085194
C  2.322251 1.091659 -0.059721
C  2.523523 -1.721965 0.297819
C  -3.778959 -0.48186 -0.213356
C  -3.497736 -1.862337 -0.221708
C  3.56425 0.472012 0.109009
C  3.684192 -0.928932 0.289792
C  -2.623916 2.76843 0.901553
H  -1.924171 -3.386026 -0.050574
H  2.218324 2.170054 -0.209705
H  2.57623 -2.806625 0.424235
H  -4.804496 -0.106686 -0.265777
H  -4.318386 -2.582319 -0.302323
H  4.669618 -1.38584 0.41714
H  -1.76812 3.27649 0.433771
H  -2.304642 2.271029 1.836782
H  -3.450275 3.466529 1.106923
