program: Gaussian 09
title: 000180466
version: EM64L-G09RevD.01
frameworkgroup: C1[X(C10H11ClN4O2)]
method: RPBEPBE
basis: SDD
operation: Freq
keyword: #p
keyword: freq=noraman
keyword: PBEPBE/SDD
title: #p freq=noraman PBEPBE/SDD
converged: YES YES NO NO
title: Mulliken charges:
elementType: Cl O O N N N N C C C C C C C C C C H H H H H H H H H H H
charge: 0.025481 -0.267002 -0.435539 -0.175294 -0.029934 -0.018348 0.062151 -0.154861 -0.486607 0.017525 -0.347659 -0.404644 0.123505 -0.203374 0.136329 -0.320248 -0.358101 0.273193 0.233065 0.250315 0.245670 0.219866 0.253394 0.201610 0.249617 0.309494 0.343824 0.256573
chargesum: 0.00000
title: Mulliken charges with hydrogens summed into heavy atoms:
elementType: Cl O O N N N N C C C C C C C C C C
charge: 0.025481 -0.267002 -0.091715 -0.175294 -0.029934 -0.018348 0.062151 0.118332 -0.003227 0.263196 0.125600 0.046583 0.123505 0.106120 0.136329 -0.320248 -0.101528
polarizability: 1.99809216e+02 -5.45487555e+00 1.42074502e+02 1.10263942e+01 1.48606480e+01 1.00481926e+02
1716.lowfreq: 0.0027 0.0029 0.0030 4.2808 5.4286 12.8618 20.5860 33.7493 61.0685
frequency: 18.3701 33.6266 60.9495 80.0128 110.9499 142.1139 164.7267 211.0479 226.0892 228.2639 264.8635 287.7789 304.6787 378.2526 394.7266 411.5657 429.2481 538.9500 545.7091 550.5687 622.5589 628.6062 646.0102 659.2073 678.5309 764.7752 791.2145 800.0960 814.3835 878.2333 878.4034 888.0849 896.5349 916.1144 928.9534 969.9753 974.7626 1005.1360 1045.2478 1056.9951 1092.9437 1111.4332 1120.5659 1138.8247 1167.9641 1172.5447 1197.8337 1212.6727 1228.4367 1269.1124 1276.2455 1292.0748 1296.0396 1303.1015 1313.2616 1326.8471 1352.2543 1363.3219 1371.6607 1392.3519 1402.5066 1442.0807 1461.4747 1469.0147 1475.0689 1504.3356 1561.2290 2970.2257 2971.3528 2990.9507 3020.1167 3069.2296 3089.4480 3100.1469 3104.8058 3187.1445 3235.4153 3566.7573
redmass: 5.9891 6.7562 4.8631 3.1834 7.1520 7.2118 5.1464 8.7992 3.6878 4.8868 5.3897 1.2700 2.6279 13.8138 5.1384 2.1517 3.7423 6.0896 4.6883 5.1271 6.7030 6.3236 6.8300 5.3482 5.8290 3.8626 9.0219 10.0370 3.3566 1.6835 1.3979 4.3172 4.2797 1.4330 3.2871 2.1129 4.4894 4.9104 1.9822 2.1205 3.8402 4.5866 1.7008 1.4469 2.6109 1.6557 1.5184 1.4215 1.6209 1.2433 3.5613 1.3863 4.3752 4.1097 1.3026 1.3032 1.3490 5.3248 1.3017 1.4409 1.8356 4.3719 1.0823 1.0853 1.1095 9.2017 11.0510 1.0702 1.0689 1.0821 1.0623 1.0886 1.1016 1.0972 1.0982 1.0929 1.0995 1.0666
irintensity: 1.4624 0.7231 1.1258 5.2885 4.0011 0.3349 1.7077 3.6770 1.0955 1.3040 0.1087 144.0601 25.3951 7.1563 2.2085 3.5223 1.1712 17.4421 4.7246 5.4344 4.8236 4.9489 2.7809 16.7045 14.7761 2.5608 2.7893 39.7302 1.1000 5.4994 30.0467 40.3242 52.4530 12.5618 18.6183 5.2539 96.9602 72.2420 4.7984 20.1753 27.9288 2.6489 6.1151 34.7208 41.3382 1.5662 17.4607 31.4772 118.0046 2.7843 17.5512 18.5936 23.3678 88.9552 10.8662 0.4614 9.9141 28.5773 7.4417 37.9005 29.4318 90.5312 11.8175 7.7635 0.1450 136.0780 95.0855 42.6337 26.7759 84.7107 15.1248 1.6104 22.4349 24.6469 18.2185 9.1302 6.1714 9.9864
temp: 298.150 k
press: 1.00000 atm
elementType: 17 8 8 7 7 7 7 6 6 6 6 6 6 6 6 6 6 1 1 1 1 1 1 1 1 1 1 1
symmnumber: 1
zpe: 549367.7 jmol-1
zpe.correction: 0.209243 hartree
zpe.thermalcorrener: 0.223968 hartree
zpe.thermalcorrenthalpy: 0.224912 hartree
zpe.thermalcorrgfe: 0.165097 hartree
zpe.sumelectzpe: -1215.892707 hartree
zpe.sumelectthermal: -1215.877983 hartree
zpe.sumelectthermalent: -1215.877038 hartree
zpe.sumelectthermalfe: -1215.936853 hartree
dipole: -3.7605 3.5853 0.5184
dipole: 5.2216
quadrupole: -131.3224 -107.6687 -103.6171
quadrupole: -4.5488 0.3451 -2.4161
quadrupole: -17.1196 6.5340 10.5856 -4.5488 0.3451 -2.4161
hfenergy: -1216.1019502 hartree
pointgroup: C01 [X(C10H11Cl1N4O2)]
dipole: 1.3099059 -1.5398748 -0.3649978 debye
polarizability: 196.8355683|-6.5623761|147.6335589|-18.9946858|3.0408599|97.8965162 unknown
InChI: InChI=1S/C10H11ClN4O2/c11-9-8-10(13-4-12-9)15(5-14-8)6-1-7(2-16)17-3-6/h4-7,16H,1-3H2
charge 0 multiplicity 1
28 atoms
Cl -4.21235 2.165125 0.936495
O  3.025245 0.427395 -1.345315
O  4.703183 0.503334 2.002436
N  0.158886 -0.035333 -0.33476
N  -0.976076 1.942232 0.00646
N  -1.658063 -1.6360 0.173418
N  -3.740866 -0.504885 0.77613
C  1.247526 -0.99047 -0.638135
C  2.339149 -1.026958 0.482476
C  3.520193 -0.161164 -0.068061
C  2.057805 -0.549091 -1.876448
C  3.972975 1.000979 0.829076
C  -1.137596 -0.389971 0.036473
C  0.195942 1.371823 -0.332359
C  -1.831845 0.854809 0.24443
C  -3.182972 0.70853 0.629001
C  -2.969623 -1.61947 0.545334
H  0.758357 -1.969908 -0.769998
H  1.925908 -0.628748 1.426137
H  2.6570 -2.066403 0.66689
H  4.397286 -0.803274 -0.287656
H  2.584241 -1.422427 -2.31438
H  1.461625 -0.04468 -2.652052
H  3.105594 1.630968 1.117089
H  4.698133 1.624604 0.283477
H  1.100291 1.912347 -0.604687
H  4.066889 0.113943 2.653575
H  -3.464137 -2.584808 0.675557
