program: Gaussian 09
title: 000180442
version: EM64L-G09RevD.01
frameworkgroup: C1[X(C7H9Br2F2NO3S)]
method: RPBEPBE
basis: SDD
operation: Freq
keyword: #p
keyword: freq=noraman
keyword: PBEPBE/SDD
title: #p freq=noraman PBEPBE/SDD
converged: YES YES NO NO
title: Mulliken charges:
elementType: Br Br S F F O O O N C C C C C C C H H H H H H H H H
charge: 0.126522 0.134636 0.253271 -0.134019 -0.164235 -0.420177 -0.217151 -0.279344 -0.376382 -0.111794 -0.682049 0.152696 0.174272 0.270439 -0.745959 -0.771572 0.306338 0.335349 0.303231 0.347703 0.367004 0.253998 0.218357 0.263679 0.395186
chargesum: 0.00000
title: Mulliken charges with hydrogens summed into heavy atoms:
elementType: Br Br S F F O O O N C C C C C C C
charge: 0.126522 0.134636 0.253271 -0.134019 -0.164235 -0.024991 -0.217151 -0.279344 -0.028679 0.194543 -0.043469 0.152696 0.174272 0.270439 -0.378955 -0.035537
polarizability: 1.44484113e+02 -1.59434943e+01 1.56188178e+02 1.02682588e+00 -1.10177538e+01 1.20180096e+02
1716.lowfreq: -1.3652 -0.0009 -0.0006 0.0018 2.2077 4.5657 17.0589 23.3238 34.1942
frequency: 16.9949 23.1752 33.8786 45.1098 50.0387 52.3370 56.2263 77.1263 98.2019 128.4913 144.0049 161.3910 178.4852 198.7368 228.3479 256.6348 274.4651 327.4054 349.3582 352.1300 389.2379 458.2662 498.3548 503.8241 516.4087 538.4875 583.0150 598.0387 613.0284 626.2250 651.4475 652.3607 710.1291 720.0268 813.9310 880.4137 900.5780 914.8417 945.4884 981.9983 993.7342 1042.8415 1083.9480 1099.7073 1137.1115 1142.7561 1187.7657 1237.1506 1241.2130 1250.4448 1287.2909 1320.2861 1330.5029 1387.9184 1416.4025 1447.8512 1464.2879 1482.6864 1609.1302 1666.8961 2965.8591 2999.1464 3054.7894 3091.9248 3117.4928 3121.3655 3140.0796 3521.3875 3574.4067
redmass: 10.7528 8.1802 7.1853 2.8409 11.9134 2.0027 4.1918 4.8575 7.6197 8.3787 8.0534 18.5113 7.9764 17.9907 10.2255 4.0795 19.1091 3.2607 12.8269 4.1005 13.1767 2.9869 9.6190 3.7181 4.1102 1.4192 3.3158 4.1107 4.6101 2.9734 1.8536 7.6254 8.9722 4.5901 3.2167 8.0073 2.6425 5.5527 4.7461 2.9537 1.5610 1.6695 1.8841 7.5687 1.0823 1.9264 1.6235 1.2684 1.4012 1.4178 1.6962 1.4943 2.0677 1.2330 1.0835 1.1038 1.0917 1.8885 6.0637 9.4079 1.0801 1.0366 1.0584 1.0982 1.1000 1.0871 1.1072 1.0643 1.0787
irintensity: 0.2744 1.0954 0.5015 5.5448 0.8453 3.0922 8.2838 5.4602 1.1399 0.3816 3.4078 1.1248 1.8615 0.1012 3.8211 4.9321 2.0292 4.6682 1.7894 1.1926 2.1324 30.8889 18.4244 12.2565 47.0730 120.6802 51.1042 19.7495 46.3339 109.3643 82.6545 65.1411 67.8799 13.2726 13.1944 99.8172 19.9433 74.6188 18.1933 78.1243 3.8155 18.9343 155.4202 56.4292 13.7403 12.4415 18.3669 5.2833 8.4790 13.6315 54.3602 33.8751 31.9837 60.8867 28.2705 63.0133 40.0781 198.4934 138.9069 209.9377 19.3134 5.7992 2.5497 13.0312 11.2276 2.7537 0.9295 39.4908 44.7297
temp: 298.150 k
press: 1.00000 atm
elementType: 35 35 16 9 9 8 8 8 7 6 6 6 6 6 6 6 1 1 1 1 1 1 1 1 1
symmnumber: 1
zpe: 424465.1 jmol-1
zpe.correction: 0.161670 hartree
zpe.thermalcorrener: 0.180850 hartree
zpe.thermalcorrenthalpy: 0.181794 hartree
zpe.thermalcorrgfe: 0.108462 hartree
zpe.sumelectzpe: -1175.994145 hartree
zpe.sumelectthermal: -1175.974965 hartree
zpe.sumelectthermalent: -1175.974021 hartree
zpe.sumelectthermalfe: -1176.047353 hartree
dipole: 0.4259 0.0032 -3.7388
dipole: 3.7630
quadrupole: -118.7348 -119.5545 -119.4966
quadrupole: 3.4664 -11.1352 -4.7488
quadrupole: 0.5271 -0.2925 -0.2346 3.4664 -11.1352 -4.7488
hfenergy: -1176.1558152 hartree
pointgroup: C01 [X(C7H9Br2F2N1O3S1)]
dipole: -0.0566369 -0.769417 1.2635471 debye
dipolederiv: -0.1243538 -0.0790542 -0.0884755 -0.0972761 -0.3136672 -0.3669261 -0.0751416 -0.2786926 -0.3354013 -0.2365398 0.0377538 0.2293781 -0.021401 -0.0345937 -0.0646994 0.2220311 -0.1206575 -0.4228943 -0.374361 -0.2472212 -0.0947646 -0.1667432 -0.0997308 -0.1293012 -0.1919344 -0.1181741 -0.2185994 -0.396573 0.0799916 -0.0943742 0.013135 -0.6342275 0.1424246 -0.1020716 0.1463689 -0.3399221 -0.5984699 0.0290787 0.2757014 -0.0509167 -0.3407117 -0.1280187 0.0747146 -0.1873148 -0.6897144 -0.4974817 -0.0371524 0.2132666 -0.0645663 -0.3146795 0.0643905 0.3255972 0.0427213 -1.0749897 -0.3830662 -0.0405407 0.0552897 -0.02967 -0.956154 -0.296606 0.1214494 -0.0421947 -0.6197978 -0.4546939 0.1154442 -0.0855557 0.1596311 -0.6925264 0.0166004 -0.1897973 0.2421851 -0.8585579 -0.6295754 0.12447 0.04733 0.3046629 -1.12948 0.1526272 0.0662657 0.1288431 -0.4148662 0.1628269 -0.0166065 -0.0678281 -0.1493126 0.1683594 0.1362873 -0.2512295 0.4193213 0.0420286 0.5104899 0.0991883 0.1501525 -0.0402453 -0.2095723 0.0178193 0.2367025 -0.0551328 0.164287 1.0626137 0.0937605 -0.0786148 0.269417 1.0306612 0.0760607 0.2514362 0.1501452 0.8970654 0.3777369 0.1011475 -0.259906 0.2173033 1.2812121 0.1413385 -0.445773 -0.0872303 1.312926 0.3679106 -0.3193824 0.1464108 -0.5107253 1.4246219 -0.1069544 0.250253 -0.2661668 0.994702 0.285191 0.1169131 -0.19519 0.0380639 0.3940418 0.496077 -0.3305439 0.4650225 0.9262203 0.0218748 -0.0154089 -0.0230165 0.0570492 -0.2707846 -0.2172481 0.010613 -0.2019683 -0.1175796 -0.0170115 -0.0602819 -0.0496549 -0.0002382 0.1295277 0.0107769 0.0382697 -0.0953166 0.0726559 0.0012126 -0.0376404 -0.0382766 -0.0309887 0.0600068 0.0598766 -0.0239705 0.0496662 0.0839376 -0.0206507 0.0125237 -0.0457414 0.0581018 0.0653087 -0.0713545 -0.0138151 -0.0842178 0.0475291 0.3849822 0.0614231 -0.0595514 0.0669665 0.2127351 -0.0198607 -0.0262771 -0.0539009 0.1714654 0.0461475 -0.0586296 0.0583814 -0.0004099 -0.0302039 -0.0303055 0.0441784 -0.0398446 -0.0270375 -0.0107291 0.1232895 -0.0065115 0.0864136 0.0564542 0.0045076 -0.0519126 0.0130531 0.0834898 0.1219164 0.0056266 0.0074234 -0.0143743 0.0297646 0.1067841 0.0236564 0.0330944 -0.0998676 -0.0051625 -0.100651 0.0060328 -0.0811593 0.0759492 -0.0018967 0.0354558 -0.0072154 0.0777027 0.4057662 0.0119584 -0.0019056 -0.0127174 0.097689 0.0076004 0.0018436 -0.0523939 0.3452183 unknown
polarizability: 134.7588587|9.373202|146.3318797|0.589025|24.3335852|139.7616488 unknown
InChI: InChI=1S/C7H9Br2F2NO3S/c1-3(13)12-4(5(14)15)2-16-7(10,11)6(8)9/h4,6,12,14H,2H2,1H3
charge 0 multiplicity 1
25 atoms
Br 3.276381 2.165327 1.99583
Br 4.02434 0.614575 -0.813931
S  1.009575 -1.21077 -0.278941
F  0.962556 1.539007 -0.298872
F  0.668267 0.589309 1.750098
O  -2.434658 -2.180427 1.332523
O  -1.958449 -3.295086 -0.650365
O  -2.541669 1.741694 -1.322883
N  -2.004375 0.239947 0.352039
C  -1.850615 -0.840634 -0.615274
C  -0.494248 -0.804113 -1.365904
C  1.399035 0.452443 0.505582
C  -2.081551 -2.226477 -0.017701
C  -2.33812 1.51307 -0.089332
C  2.901814 0.569557 0.84016
C  -2.412943 2.58934 0.981429
H  -2.615341 -0.685255 -1.40746
H  -0.342982 0.18762 -1.817163
H  -0.45957 -1.585671 -2.142382
H  -1.836858 0.043858 1.339483
H  3.226231 -0.306997 1.418934
H  -3.273004 3.245911 0.773963
H  -2.499546 2.180542 2.002447
H  -1.498765 3.208034 0.931197
H  -2.564007 -3.105103 1.677524
