program: Gaussian 09
title: 000180399
version: EM64L-G09RevD.01
frameworkgroup: C1[X(C18H23NO)]
method: RPBEPBE
basis: SDD
operation: Freq
keyword: #p
keyword: freq=noraman
keyword: PBEPBE/SDD
title: #p freq=noraman PBEPBE/SDD
converged: YES YES NO NO
title: Mulliken charges:
elementType: O N C C C C C C C C C C C C C C C C C C H H H H H H H H H H H H H H H H H H H H H H H
charge: -0.290219 -0.016296 0.016557 -0.622470 -0.416855 -0.394951 0.519468 -0.714391 -0.718258 -0.400393 -0.421211 -0.397588 -0.353840 0.380957 -0.336160 0.063887 -0.338825 -0.175291 -0.362613 -0.181426 0.203132 0.207714 0.201970 0.223027 0.209032 0.194080 0.204585 0.215294 0.221454 0.211910 0.211811 0.221935 0.214458 0.231783 0.230139 0.243600 0.250436 0.237444 0.236830 0.278949 0.238850 0.240867 0.230617
chargesum: 0.00000
title: Mulliken charges with hydrogens summed into heavy atoms:
elementType: O N C C C C C C C C C C C C C C C C C C
charge: -0.290219 -0.016296 0.219689 -0.212786 0.015204 0.003714 0.519468 -0.065732 -0.070054 -0.168609 -0.191072 -0.153989 -0.103404 0.380957 0.138113 0.063887 -0.059876 0.063560 -0.121746 0.049191
polarizability: 3.05080211e+02 3.62056543e+00 1.92407137e+02 1.31834376e+01 -4.93689575e+00 1.20606041e+02
1716.lowfreq: -30.8795 -6.7887 -2.4726 -0.0013 -0.0007 -0.0005 12.3184 19.9023 25.7657
frequency: -16.3005 19.2321 25.4357 40.0454 58.2742 68.6112 84.9294 107.6054 110.2300 158.7890 176.6246 201.4500 209.6535 212.2183 231.0170 266.0960 280.3743 323.6477 342.3019 350.6688 402.9646 412.2569 456.8584 469.6732 472.1330 502.9353 520.7103 550.0648 608.2657 625.9727 635.6869 713.6723 740.7840 744.9038 753.1814 762.6620 772.2849 801.6872 816.3066 820.5390 833.5925 841.9619 894.9147 908.1013 929.0801 940.5911 956.9501 960.3155 963.5065 964.5594 1002.4521 1003.1891 1006.1295 1006.5049 1019.3983 1026.0220 1039.0740 1054.6161 1076.4526 1086.8987 1121.8890 1145.1767 1150.7565 1162.0915 1178.2574 1182.7956 1202.1318 1213.7233 1224.5280 1244.8626 1245.2941 1269.4901 1273.2894 1277.5046 1304.9110 1315.6827 1319.8724 1332.6904 1342.5883 1355.0605 1359.1818 1382.3001 1384.1531 1389.1501 1414.9720 1417.1954 1455.2642 1459.8673 1464.0014 1467.6454 1477.3781 1479.3275 1482.9690 1484.8936 1491.8681 1501.2991 1568.3225 1583.5058 1588.5568 1622.9921 2943.2938 2956.3645 2962.6203 2973.4871 2974.0772 2978.5512 2985.0358 3010.8041 3012.7122 3026.5788 3030.3914 3066.6805 3069.3934 3071.6850 3074.3896 3116.8184 3121.9394 3128.3334 3142.2412 3157.6993 3161.8548 3166.9914 3189.4581
redmass: 3.3896 4.8330 3.8357 3.7170 4.6821 4.1097 2.5717 2.2574 2.3306 3.6200 3.7599 2.3260 2.7372 1.1505 2.4377 3.0125 1.9495 3.0096 3.7510 2.6939 3.4055 2.9458 2.7601 4.3751 2.7321 2.8390 2.6473 3.1429 6.6614 5.6903 6.7278 3.0429 1.7808 3.7140 1.6864 1.1754 2.8874 1.4027 1.9380 2.0599 3.0539 2.1134 1.5927 1.2684 1.6016 1.5164 1.4357 1.6921 6.4279 1.6611 5.5064 1.4178 1.3641 3.0110 1.7161 1.7471 2.2622 2.4652 1.5079 1.6389 1.3782 1.8990 2.4179 1.0732 1.2695 1.2428 1.0703 2.0212 3.9703 2.5599 1.3580 1.2653 1.1141 1.5243 1.3403 1.5424 4.1504 1.5832 1.4750 1.4058 1.6158 1.2332 3.6243 1.2188 2.3592 2.4987 1.7907 1.0702 1.3330 1.0655 1.0607 1.0767 1.0512 1.0551 1.0692 2.4841 6.0409 6.5795 6.2119 6.5191 1.0812 1.0555 1.0597 1.0566 1.0369 1.0400 1.0619 1.1005 1.1050 1.0999 1.1003 1.0993 1.0991 1.0993 1.0997 1.0893 1.0891 1.0882 1.0906 1.0939 1.0952 1.0985 1.0962
irintensity: 0.1718 0.9093 0.2790 1.0921 0.2368 0.6407 0.0398 1.0766 0.6494 1.5505 1.8676 1.8273 6.4890 0.1869 1.6040 0.9077 0.1938 2.3419 1.0650 1.8064 4.0423 0.0321 1.4850 2.8269 7.2954 2.6995 10.9176 12.9296 5.5960 6.0920 0.0745 2.6619 6.6192 0.0478 24.1298 70.3626 6.6266 28.5727 9.3644 2.7634 11.9533 34.9698 4.9782 0.2118 6.3741 1.2352 0.7345 0.8897 6.6371 1.1452 27.7550 9.4813 0.1191 57.1359 1.9336 5.7296 8.4393 1.1006 3.4383 11.0632 18.9663 7.2161 7.6350 1.0591 39.8292 38.8339 1.4073 121.3222 175.5705 28.5264 2.3788 2.3037 4.9549 1.5093 1.1128 2.0361 9.6863 1.3947 0.7197 0.3494 11.5471 23.1635 26.5937 11.6366 13.8721 17.9760 92.8596 0.4865 10.6106 3.7712 7.1533 31.2176 3.1940 7.9333 5.1364 170.7134 13.4234 35.5018 26.4257 47.3023 14.1841 23.4695 21.4717 45.5824 30.8989 61.3924 21.9310 19.0378 22.1194 21.1245 41.8665 50.8507 54.8223 94.9434 33.6252 18.1577 25.8992 11.9857 15.5734 15.4533 5.3946 33.2032 3.5507
temp: 298.150 k
press: 1.00000 atm
elementType: 8 7 6 6 6 6 6 6 6 6 6 6 6 6 6 6 6 6 6 6 1 1 1 1 1 1 1 1 1 1 1 1 1 1 1 1 1 1 1 1 1 1 1
symmnumber: 1
zpe: 957155.5 jmol-1
zpe.correction: 0.364561 hartree
zpe.thermalcorrener: 0.383727 hartree
zpe.thermalcorrenthalpy: 0.384671 hartree
zpe.thermalcorrgfe: 0.314926 hartree
zpe.sumelectzpe: -828.188363 hartree
zpe.sumelectthermal: -828.169198 hartree
zpe.sumelectthermalent: -828.168254 hartree
zpe.sumelectthermalfe: -828.237999 hartree
dipole: 0.2478 0.7741 0.1811
dipole: 0.8327
quadrupole: -101.1232 -115.4156 -125.9954
quadrupole: 8.2378 2.7574 -0.0461
quadrupole: 13.0549 -1.2375 -11.8173 8.2378 2.7574 -0.0461
hfenergy: -828.5529246 hartree
pointgroup: C01 [X(C18H23N1O1)]
dipole: -0.0948637 0.3110433 -0.0398427 debye
polarizability: 304.8320548|-5.9264903|190.6966472|13.9522279|12.1110746|122.5646876 unknown
InChI: InChI=1S/C18H23NO/c1-3-15(4-2)13-16-8-10-18(11-9-16)20-14-17-7-5-6-12-19-17/h5-12,15H,3-4,13-14H2,1-2H3
charge 0 multiplicity 1
43 atoms
O  -1.857165 0.289584 0.356312
N  -5.024614 -1.327861 -0.528907
C  4.634445 -0.503068 -0.201726
C  3.827777 -0.413897 1.136225
C  4.544464 0.805556 -1.03816
C  6.092578 -0.950656 0.092203
C  2.326767 -0.251762 0.947006
C  5.261765 2.033141 -0.429091
C  6.957624 -1.174201 -1.167207
C  1.686466 1.008272 1.095321
C  1.518041 -1.359672 0.592557
C  0.30097 1.158981 0.893573
C  0.125773 -1.233251 0.385247
C  -0.483299 0.036842 0.535288
C  -2.708105 -0.842079 -0.015869
C  -4.133898 -0.350311 -0.175256
C  -4.509513 0.998603 0.022279
C  -5.866717 1.352145 -0.154326
C  -6.329175 -0.96906 -0.694765
C  -6.797922 0.353589 -0.519762
H  4.159258 -1.303867 -0.810667
H  4.225555 0.421761 1.744049
H  4.029568 -1.3407 1.710567
H  3.474797 1.048488 -1.190073
H  4.959374 0.614091 -2.04709
H  6.05443 -1.894569 0.674379
H  6.583118 -0.206367 0.75208
H  5.115359 2.923174 -1.068287
H  6.350538 1.866536 -0.335029
H  4.87267 2.280779 0.575895
H  6.477926 -1.897063 -1.854443
H  7.116924 -0.234907 -1.727274
H  7.952644 -1.574612 -0.898403
H  2.282811 1.885027 1.376439
H  1.981463 -2.348228 0.481599
H  -0.190199 2.130093 1.010067
H  -0.460723 -2.117308 0.11811
H  -2.674078 -1.62948 0.764968
H  -2.365166 -1.291818 -0.970302
H  -3.749906 1.730895 0.30365
H  -6.190677 2.388412 -0.009485
H  -7.014577 -1.776449 -0.977719
H  -7.857168 0.587218 -0.666072
