program: Gaussian 09
title: 000180421
version: EM64L-G09RevD.01
frameworkgroup: C1[X(C21H26O7)]
method: RPBEPBE
basis: SDD
operation: Freq
keyword: #pfreq=noraman
keyword: PBEPBE/SDD
title: #p freq=noraman PBEPBE/SDD
converged: YES YES NO NO
title: Mulliken charges:
elementType: O O O O O O O C C C C C C C C C C C C C C C C C C C C C H H H H H H H H H H H H H H H H H H H H H H H H H H
charge: -0.284315 -0.243359 -0.277862 -0.262479 -0.241056 -0.285904 -0.220186 0.026004 -0.591971 0.590251 -0.732672 -0.661956 -0.546136 0.112510 0.243115 0.280645 0.026499 0.232216 0.282760 -0.547969 -0.540135 0.463734 -0.546710 -0.533427 -0.225832 -0.519525 -0.537590 -0.537535 0.254881 0.202265 0.245540 0.218850 0.229283 0.235325 0.240253 0.289063 0.249369 0.285745 0.240063 0.226376 0.226593 0.224996 0.242368 0.215299 0.164400 0.245074 0.209208 0.227493 0.224502 0.219855 0.250153 0.250727 0.229936 0.231265
chargesum: 0.00000
title: Mulliken charges with hydrogens summed into heavy atoms:
elementType: O O O O O O O C C C C C C C C C C C C C C C C C C C C C
charge: -0.284315 -0.243359 -0.277862 -0.262479 -0.241056 -0.285904 -0.220186 0.280885 -0.144165 0.590251 -0.049214 -0.421702 -0.257074 0.112510 0.243115 0.280645 0.026499 0.232216 0.282760 -0.298600 -0.254389 0.463734 0.146322 0.149236 -0.061432 0.162250 0.156921 0.174393
polarizability: 3.72524236e+02 -2.30637037e+01 2.77072937e+02 2.73318813e+01 5.45271058e+00 1.82588488e+02
1716.lowfreq: -7.9894 -6.5722 -1.2451 0.0003 0.0006 0.0008 9.6142 14.5042 21.1866
frequency: 8.6814 14.4794 21.1801 46.0643 53.2187 62.4337 65.5940 75.1119 78.6262 103.3357 104.9703 115.2629 118.7034 123.6280 141.9745 157.1292 165.8020 181.8164 185.1244 189.4360 197.6597 210.9146 219.9369 225.7674 232.7987 250.2308 262.2966 266.1220 268.8538 286.9118 293.7894 306.1176 318.5790 329.9272 347.9245 352.1502 371.5675 387.7161 422.8582 433.6336 473.1085 482.2288 504.8920 515.0130 538.2141 580.6963 583.4660 589.3761 593.7853 604.3217 617.0232 663.7601 679.5484 728.8899 731.1623 766.3596 775.5215 822.8509 839.0106 842.0324 855.9310 866.7381 869.6738 871.8601 895.9231 916.5125 950.6889 954.5881 957.3270 985.7518 1012.3572 1013.6389 1031.5495 1087.0433 1088.7388 1098.4561 1107.1858 1111.2897 1111.4051 1111.7174 1113.2893 1125.6633 1135.4001 1141.8633 1154.9340 1155.6909 1157.0900 1159.5032 1160.1586 1200.3042 1210.7239 1215.8751 1223.7119 1234.9412 1291.4797 1302.4157 1312.0968 1316.1594 1360.7460 1364.5156 1383.2754 1386.1909 1403.5806 1414.5352 1415.1858 1421.9351 1441.6730 1442.2730 1443.1995 1445.9313 1450.9356 1457.7042 1463.1342 1465.2473 1465.4425 1465.6820 1465.8555 1468.3486 1471.2831 1472.3387 1474.2917 1475.8406 1478.6107 1480.9546 1494.6174 1572.4697 1586.0682 1592.7470 1600.5107 1614.9295 2866.2392 2957.3328 2957.7042 2960.6197 2967.7059 2970.1461 2978.3430 2983.9342 3035.0217 3044.3680 3045.0458 3046.1365 3049.4291 3062.0541 3067.2106 3078.9566 3092.9983 3116.3654 3120.0519 3120.9282 3128.7930 3132.2406 3142.4738 3145.3565 3162.2247 3178.7930
redmass: 4.8999 4.7196 6.3399 4.9514 3.4449 4.2160 3.0037 3.3905 2.8827 3.6611 3.5339 4.2366 3.9273 5.0852 5.4953 3.8131 1.2154 3.0609 1.9132 2.8369 1.8042 2.3810 3.1461 1.3579 1.2477 1.4001 1.9609 2.0329 3.8662 1.6672 2.3397 3.0421 4.0332 3.9476 4.3915 4.2890 4.7863 3.6410 4.1265 4.5710 4.7842 5.0481 6.6766 6.9903 5.0614 4.0359 4.6495 4.5395 3.9362 4.6361 3.9558 3.8165 4.5260 4.9454 4.8233 2.7328 3.6040 1.9082 2.5251 2.4857 1.5789 5.9151 5.1816 1.4731 2.0479 2.0228 7.4199 8.8167 4.9292 1.8497 4.4996 4.6330 1.9640 6.3091 7.4997 2.4936 1.2560 1.2600 1.2581 1.2599 1.2619 2.1934 2.3890 2.2409 1.4978 1.4229 1.4773 1.4772 1.4540 1.7932 1.7297 1.5738 1.4216 1.6456 1.4753 1.5724 3.0724 3.1997 1.9392 1.8607 1.8652 2.1914 2.5393 2.5175 1.7851 1.2043 1.1415 1.2213 1.2078 1.5650 1.3664 1.0832 1.8357 1.0823 1.0604 1.0512 1.0595 1.0514 1.1769 1.0936 1.0556 1.0766 1.0551 1.4307 2.5077 8.2532 5.9544 7.7297 6.0523 6.9124 1.0847 1.0330 1.0330 1.0331 1.0322 1.0322 1.0590 1.0382 1.0938 1.1032 1.1036 1.0913 1.1039 1.1044 1.1014 1.0987 1.1000 1.1025 1.0994 1.0997 1.0992 1.1007 1.0905 1.0904 1.0912 1.0909
irintensity: 0.1571 0.3590 0.2684 1.2141 1.3240 4.5348 10.4182 3.6433 4.9043 1.0275 2.7553 1.7962 6.6376 9.5656 8.4758 3.9755 0.8050 3.6616 0.1660 2.4860 0.4751 3.4019 1.7432 2.1044 3.6627 0.1972 2.6429 3.3038 1.7646 0.2717 1.0534 1.2128 7.7819 5.8324 1.2867 0.2356 0.8478 5.4651 2.3755 9.6020 17.6028 3.7427 12.4260 4.9138 0.5636 5.5748 2.0855 2.0039 5.2511 47.6219 8.5131 12.4588 13.0623 29.5183 29.1001 17.1919 9.2405 18.2757 45.9186 19.7473 12.2098 1.4039 4.3769 22.0393 9.8735 4.3135 1.9208 48.3871 13.3784 10.8439 25.9723 1.1842 30.4422 310.5093 311.1049 31.4333 13.1863 0.6824 0.3315 0.2163 0.1749 229.4188 89.9612 29.6122 17.9366 33.8581 34.2748 0.6030 6.7329 41.5988 89.8740 10.1208 42.9948 90.7082 9.3757 138.2884 195.3058 50.8356 20.0291 42.0580 13.0755 17.7878 30.5804 131.1094 34.2072 9.6301 5.1025 5.5319 3.5907 98.0884 66.1334 3.1652 93.3886 28.9767 6.3429 17.9787 2.0938 14.0130 40.4742 47.1244 53.5455 23.8852 12.9656 32.6811 73.6852 270.7134 51.5499 149.1999 27.2618 145.0427 140.8262 107.1928 31.1626 70.6792 78.8379 51.7246 10.0669 27.7989 8.3798 40.8670 49.6807 21.3016 45.0519 33.4458 38.5763 39.8674 22.6896 26.8572 28.6784 28.6863 19.2727 16.8897 10.5235 6.5892 2.3843 2.8115
temp: 298.150 k
press: 1.00000 atm
elementType: 8 8 8 8 8 8 8 6 6 6 6 6 6 6 6 6 6 6 6 6 6 6 6 6 6 6 6 6 1 1 1 1 1 1 1 1 1 1 1 1 1 1 1 1 1 1 1 1 1 1 1 1 1 1
symmnumber: 1
zpe: 1129213.7 jmol-1
zpe.correction: 0.430095 hartree
zpe.thermalcorrener: 0.460485 hartree
zpe.thermalcorrenthalpy: 0.461430 hartree
zpe.thermalcorrgfe: 0.366215 hartree
zpe.sumelectzpe: -1340.182055 hartree
zpe.sumelectthermal: -1340.151664 hartree
zpe.sumelectthermalent: -1340.150720 hartree
zpe.sumelectthermalfe: -1340.245935 hartree
dipole: 1.0886 4.1354 -2.3453
dipole: 4.8772
quadrupole: -173.0415 -153.5496 -159.7509
quadrupole: 12.1800 30.0810 1.9765
quadrupole: -10.9275 8.5644 2.3631 12.1800 30.0810 1.9765
hfenergy: -1340.6121495 hartree
pointgroup: C01 [X(C21H26O7)]
dipole: 0.6701112 -1.2863121 1.256285 debye
polarizability: 361.8671802|22.5905475|277.4488272|-45.8778103|-23.9274669|192.8696526 unknown
InChI: InChI=1S/C21H26O7/c1-13(7-14-8-16(23-2)20(27-6)17(9-14)24-3)28-21-18(25-4)10-15(12-22)11-19(21)26-5/h8-13H,7H2,1-6H3
charge 0 multiplicity 1
54 atoms
O  1.316204 -1.100824 -0.09987
O  -2.791187 1.432592 -1.845218
O  -5.551054 -1.239809 0.998966
O  -5.245329 0.725776 -0.949296
O  3.519115 -2.247409 -1.092898
O  1.277738 1.569538 0.704159
O  6.135468 3.279502 -0.496715
C  0.660902 -1.311773 1.253327
C  -0.597865 -2.146695 0.947295
C  -1.818746 -1.361338 0.477773
C  1.648394 -2.038004 2.175914
C  -3.095023 -1.675556 0.999759
C  -1.693673 -0.336587 -0.487756
C  2.45768 -0.310793 -0.185842
C  -2.835171 0.38117 -0.918502
C  -4.24194 -0.976485 0.550391
C  -4.128794 0.06503 -0.412352
C  3.626751 -0.891395 -0.770848
C  2.481804 1.073355 0.183023
C  4.784044 -0.107158 -0.976257
C  3.64097 1.848623 -0.007057
C  4.788352 1.255753 -0.588235
C  -1.48468 1.746987 -2.428153
C  -5.737722 -2.376829 1.900166
C  6.010621 2.061012 -0.803153
C  -6.023459 1.552162 -0.005394
C  4.674249 -2.875087 -1.741404
C  1.234998 2.991814 1.068265
H  0.395488 -0.31698 1.652883
H  -0.861596 -2.713336 1.860549
H  -0.302053 -2.895205 0.184473
H  1.205931 -2.160613 3.181613
H  2.585852 -1.464197 2.287576
H  1.897112 -3.035622 1.772831
H  -3.186649 -2.468256 1.749179
H  -0.70089 -0.104782 -0.879011
H  5.687414 -0.537442 -1.42118
H  3.695107 2.906912 0.26464
H  -1.675224 2.58404 -3.116195
H  -1.076084 0.885076 -2.990336
H  -0.755837 2.052803 -1.651536
H  -5.385356 -3.318556 1.436472
H  -6.82304 -2.431497 2.072276
H  -5.215733 -2.221692 2.865074
H  6.859648 1.503429 -1.275957
H  -6.456371 0.929598 0.797265
H  -5.387158 2.348252 0.428092
H  -6.823166 2.004186 -0.612183
H  4.908883 -2.38515 -2.706198
H  5.566834 -2.855645 -1.085883
H  4.367985 -3.916026 -1.919046
H  0.209693 3.161473 1.427166
H  1.439285 3.634159 0.190844
H  1.960084 3.2198 1.872209
