program: Gaussian 09
title: 000180397
version: EM64L-G09RevD.01
frameworkgroup: C1[X(C19H25NO2)]
method: RPBEPBE
basis: SDD
operation: Freq
keyword: #p
keyword: freq=noraman
keyword: PBEPBE/SDD
title: #p freq=noraman PBEPBE/SDD
converged: YES YES NO NO
title: Mulliken charges:
elementType: O O N C C C C C C C C C C C C C C C C C C C H H H H H H H H H H H H H H H H H H H H H H H H H
charge: -0.285409 -0.264555 -0.037274 0.016364 -0.621186 -0.393654 -0.415830 0.521427 -0.718570 -0.714136 -0.400913 -0.419251 -0.394236 -0.355937 0.361328 -0.399628 0.404259 -0.303314 -0.497229 -0.304333 0.130070 -0.510744 0.201097 0.208500 0.202084 0.204422 0.193819 0.208355 0.222371 0.211227 0.222206 0.214694 0.215891 0.221015 0.212677 0.231542 0.229517 0.247608 0.244207 0.219816 0.222817 0.237332 0.276500 0.254159 0.236615 0.237434 0.226848
chargesum: 0.00000
title: Mulliken charges with hydrogens summed into heavy atoms:
elementType: O O N C C C C C C C C C C C C C C C C C C C
charge: -0.285409 -0.264555 -0.037274 0.217461 -0.210602 0.004587 0.014895 0.521427 -0.070443 -0.064554 -0.169371 -0.189733 -0.146627 -0.111730 0.361328 0.043004 0.404259 -0.065982 -0.220729 -0.050174 0.130070 0.190153
polarizability: 3.42966447e+02 1.02165797e+01 2.03850097e+02 1.28659256e+01 -9.18804474e+00 1.34912900e+02
1716.lowfreq: -10.4410 -0.0010 0.0004 0.0012 1.1176 6.6276 11.0850 20.2482 29.1813
frequency: 1.7469 19.5938 27.9720 39.0241 52.3066 59.1259 79.3465 93.0845 114.8081 117.5710 141.8106 148.3285 169.7681 183.5136 194.3544 211.9680 225.0961 244.8435 272.6991 293.5649 319.8967 323.6944 346.7335 352.7355 412.3725 418.1486 438.5285 459.7403 465.7022 512.0154 521.7317 528.1780 549.6741 589.2847 626.3741 634.8366 713.8816 738.9656 744.3345 747.6546 762.7696 778.6503 803.3537 814.7869 821.7537 823.8443 836.0950 842.4829 896.7625 928.6202 934.2059 940.9978 962.1590 964.5163 966.4282 970.9865 990.0414 997.7411 1004.5561 1006.0908 1019.3317 1027.1141 1055.2405 1077.9363 1113.5372 1122.9353 1124.7184 1149.5977 1149.9617 1153.4650 1178.2758 1186.1216 1204.9259 1213.5551 1222.5137 1227.9347 1248.1132 1259.4507 1270.3742 1275.4630 1285.5660 1306.3251 1320.2064 1323.7481 1336.4005 1347.6800 1350.9824 1355.6390 1379.9044 1386.3479 1391.6143 1392.4356 1415.8196 1425.1373 1448.4682 1464.4652 1466.2765 1468.2822 1470.5842 1477.3073 1480.0458 1481.7478 1485.9912 1490.1944 1495.4442 1501.1049 1555.3288 1584.2861 1605.6432 1621.9894 2927.1334 2943.2693 2964.2432 2973.3595 2973.4574 2978.8475 2979.5928 2984.5108 2998.1778 3012.3453 3025.6171 3031.3513 3066.4225 3070.0078 3071.8392 3074.5511 3098.0140 3117.0306 3124.1041 3126.7070 3137.1022 3157.7423 3163.4211 3171.5908 3183.0071
redmass: 4.1310 4.2743 3.9730 3.4888 4.6389 3.9614 4.0089 2.7895 2.8875 2.0148 1.6705 2.0128 3.4202 2.3623 3.5387 1.8397 1.1444 3.3220 3.0865 1.9889 2.8721 3.5620 4.3808 2.3049 2.9776 3.7923 4.5313 2.9151 4.4455 2.7161 2.6850 2.4891 3.3189 5.3178 7.8872 6.8107 3.2560 3.6148 3.0661 2.1923 1.6619 3.1703 1.4279 1.4435 3.6144 1.7039 2.9149 1.9913 1.5965 1.4900 1.3745 1.5385 1.5993 1.3669 1.7292 8.4832 6.0386 3.3677 2.4477 1.4785 1.7195 1.7196 2.4386 1.5095 1.2548 1.3748 1.3646 1.8440 1.4334 2.2569 1.2884 1.2756 1.2026 1.8228 2.7536 2.8650 1.2806 3.3620 1.2764 1.1082 1.5997 1.3200 1.9359 1.9929 1.5593 1.5340 2.5814 1.3863 3.6304 1.2226 1.8123 1.2779 3.1473 1.3023 1.0512 1.0655 1.0623 1.0668 1.2600 1.0565 2.0343 1.0759 1.0568 1.0594 1.0788 2.2649 6.6264 7.0166 5.9762 6.4604 1.0558 1.0813 1.0597 1.0399 1.0564 1.1039 1.0391 1.0608 1.0292 1.1000 1.1002 1.0997 1.0993 1.0990 1.0992 1.0997 1.1041 1.0891 1.0891 1.0909 1.1047 1.0937 1.0953 1.0921 1.0958
irintensity: 0.1478 0.1595 0.6640 0.0108 0.0656 0.1448 0.2225 0.1421 12.9468 2.6208 0.9291 0.6414 0.5854 2.1835 1.2739 1.7540 0.1009 1.9278 1.7884 0.1461 0.0501 9.5712 0.3055 0.2406 0.2007 1.6748 2.1579 1.0521 1.1577 3.6757 8.8567 9.4245 12.5935 25.3067 0.5549 0.7181 3.8124 13.5042 1.0372 18.6033 6.4225 1.5658 27.4795 2.1329 0.8524 53.8948 10.3763 41.2477 5.0984 2.7489 10.2528 1.2607 0.7235 2.2029 0.9539 66.7983 44.8054 30.3785 22.2925 2.7037 4.3296 6.2957 1.3189 4.3534 0.2530 18.1775 13.2352 30.5036 8.5441 1.8440 68.9892 21.1906 6.6404 140.8429 45.4683 199.7121 0.2004 181.2109 1.3045 4.7945 7.0885 0.9273 20.0648 30.0597 2.0111 0.5978 21.8897 0.2088 6.2566 16.0474 106.5349 14.5166 1.1245 9.9574 12.6192 0.1275 51.8189 5.2172 148.0597 9.8426 98.4887 29.3231 8.2564 3.0278 1.9600 154.4245 17.1068 4.0149 88.5007 43.4486 30.2506 15.3375 21.6066 35.2601 52.2421 27.9047 57.8475 18.3037 57.1493 16.7291 23.9756 41.5718 54.1298 46.7999 94.8201 39.3924 31.6945 20.0136 25.0573 12.2483 29.1707 17.6139 4.8028 8.9167 4.4824
temp: 298.150 k
press: 1.00000 atm
elementType: 8 8 7 6 6 6 6 6 6 6 6 6 6 6 6 6 6 6 6 6 6 6 1 1 1 1 1 1 1 1 1 1 1 1 1 1 1 1 1 1 1 1 1 1 1 1 1
symmnumber: 1
zpe: 1040337.4 jmol-1
zpe.correction: 0.396244 hartree
zpe.thermalcorrener: 0.419021 hartree
zpe.thermalcorrenthalpy: 0.419965 hartree
zpe.thermalcorrgfe: 0.339068 hartree
zpe.sumelectzpe: -942.546193 hartree
zpe.sumelectthermal: -942.523416 hartree
zpe.sumelectthermalent: -942.522472 hartree
zpe.sumelectthermalfe: -942.603369 hartree
dipole: -1.2440 -1.8138 0.0491
dipole: 2.2000
quadrupole: -127.9313 -121.6158 -136.9333
quadrupole: 0.1020 0.8428 -1.3494
quadrupole: 0.8955 7.2110 -8.1065 0.1020 0.8428 -1.3494
hfenergy: -942.9424367 hartree
pointgroup: C01 [X(C19H25N1O2)]
dipole: 0.4801715 -0.6989388 -0.1734402 debye
polarizability: 342.4780264|-14.978611|196.9938769|11.4699685|22.8491359|142.2575415 unknown
InChI: InChI=1S/C19H25NO2/c1-4-15(5-2)12-16-6-9-18(10-7-16)22-14-17-8-11-19(21-3)20-13-17/h6-11,13,15H,4-5,12,14H2,1-3H3
charge 0 multiplicity 1
47 atoms
O  -1.092824 0.075408 0.255411
O  -7.360633 0.364581 -0.422857
N  -5.161952 0.836238 0.327933
C  5.445912 -0.401106 -0.20357
C  4.609498 -0.339186 1.11676
C  6.925207 -0.738495 0.129172
C  5.282868 0.879215 -1.072268
C  3.105708 -0.255077 0.899906
C  7.829804 -0.935463 -1.106484
C  5.882333 2.171568 -0.470398
C  2.395771 0.96514 1.063103
C  2.364184 -1.396823 0.50847
C  1.007427 1.045712 0.843055
C  0.970196 -1.340344 0.280909
C  0.290041 -0.109301 0.450277
C  -1.882158 -1.100134 -0.12644
C  -3.337175 -0.694282 -0.23394
C  -4.256145 -1.513119 -0.948183
C  -3.844665 0.46972 0.381504
C  -5.61255 -1.15976 -1.012928
C  -6.014392 0.031788 -0.35002
C  -7.77173 1.608325 0.26028
H  5.04065 -1.246339 -0.803243
H  4.952028 0.522263 1.722281
H  4.847971 -1.24787 1.706076
H  7.349545 0.056151 0.776144
H  6.940824 -1.666499 0.737474
H  5.743428 0.699062 -2.063433
H  4.20309 1.035614 -1.262048
H  7.414844 -1.706755 -1.783224
H  7.938051 -0.002469 -1.688925
H  8.843549 -1.260285 -0.807363
H  5.695892 3.031613 -1.139512
H  6.975883 2.091094 -0.329255
H  5.434622 2.414316 0.51103
H  2.939752 1.866413 1.371243
H  2.882209 -2.356274 0.383951
H  0.462196 1.986038 0.970559
H  0.438849 -2.248793 -0.01822
H  -1.519398 -1.503031 -1.096056
H  -1.752889 -1.893247 0.642523
H  -3.909446 -2.42276 -1.453554
H  -3.174228 1.140315 0.924917
H  -6.350387 -1.758331 -1.551978
H  -7.557575 1.548533 1.340977
H  -7.237642 2.478001 -0.158907
H  -8.85334 1.676732 0.072247
