program: Gaussian 09
title: 000180410
version: EM64L-G09RevD.01
frameworkgroup: C1[X(C13H22N4O7S)]
method: RPBEPBE
basis: SDD
operation: Freq
keyword: #p
keyword: freq=noraman
keyword: PBEPBE/SDD
title: #p freq=noraman PBEPBE/SDD
converged: YES YES NO NO
title: Mulliken charges:
elementType: S O O O O O O O N N N N C C C C C C C C C C C C C H H H H H H H H H H H H H H H H H H H H H H
charge: 0.143860 -0.290146 -0.283857 -0.413567 -0.235918 -0.278461 -0.265825 -0.245107 -0.394108 -0.362672 -0.594761 -0.328587 -0.141717 -0.403875 -0.526890 -0.158109 0.244377 -0.707337 0.205751 0.174716 -0.424482 0.024075 0.279449 -0.611634 -0.507423 0.279612 0.221941 0.252109 0.226121 0.238037 0.240280 0.352138 0.330529 0.288730 0.351805 0.299242 0.272146 0.279119 0.255425 0.377683 0.331333 0.292213 0.218150 0.246284 0.273885 0.232360 0.243108
chargesum: 0.00000
title: Mulliken charges with hydrogens summed into heavy atoms:
elementType: S O O O O O O O N N N N C C C C C C C C C C C C C
charge: 0.143860 -0.290146 -0.283857 -0.035884 -0.235918 -0.278461 -0.265825 -0.245107 -0.041971 -0.010867 -0.023373 0.002745 0.137895 0.070175 -0.062732 0.082171 0.244377 -0.088078 0.205751 0.174716 0.110062 0.024075 0.279449 0.145013 0.241930
polarizability: 2.71950476e+02 9.71150948e-01 1.72692902e+02 4.92803947e+00 1.11275933e+01 1.86278429e+02
1716.lowfreq: -4.5696 -0.5294 -0.0010 0.0006 0.0013 4.1858 10.3059 12.3759 25.2205
frequency: 9.8752 10.7338 23.9744 30.0370 33.9614 44.1346 48.6063 54.5474 64.3307 66.3353 81.5548 90.3442 92.7010 95.6187 103.3355 104.9039 127.9385 153.8161 159.1830 163.3474 176.4728 189.5446 211.3806 220.4953 241.1226 247.1669 257.7704 285.9713 293.6939 311.6396 329.2824 332.3976 359.8071 382.1182 410.8602 435.9463 467.2531 499.3880 504.8243 534.2768 567.6832 584.8930 590.3265 600.6934 609.6882 615.1579 627.0772 641.4947 652.6108 669.3951 696.8078 706.0858 714.6113 765.2002 770.2492 774.9152 797.0820 819.6286 884.7035 908.4410 938.4027 953.2867 984.3461 990.3880 994.1602 1019.1633 1028.8370 1050.4263 1053.5846 1073.2067 1116.1376 1121.5939 1124.3299 1127.9434 1145.1431 1156.0754 1159.2970 1172.0116 1175.2574 1182.7363 1199.4157 1228.8596 1230.1785 1235.6258 1244.5130 1258.2542 1262.6589 1289.4822 1305.6221 1317.0943 1323.6552 1333.6462 1355.3182 1398.5774 1417.1984 1432.2142 1439.2848 1443.2580 1449.6735 1462.8091 1467.1887 1471.2558 1473.0696 1474.9023 1478.2839 1505.1141 1507.2852 1591.3332 1613.2363 1619.4235 1647.6819 1658.8006 1671.9436 2962.5276 2982.5192 2987.7369 2991.1551 2993.9483 3010.6874 3011.9725 3019.5463 3041.4423 3066.4031 3083.3564 3108.5731 3115.3743 3116.3157 3122.8998 3152.4622 3458.7972 3469.1652 3501.1617 3537.8107 3558.0319 3605.8694
redmass: 5.0141 6.4403 5.2897 6.6295 6.6027 4.9675 3.8535 6.1462 6.0303 7.6037 1.6721 5.7302 4.2811 3.1292 1.1166 4.7022 4.4093 4.1047 3.0809 3.2424 4.4277 6.1854 3.7959 3.6786 1.7586 2.0353 4.4812 3.4010 4.2208 5.0808 3.7607 3.5976 4.6720 3.6865 3.9566 9.8500 4.8747 3.6298 2.9967 1.2697 1.6028 5.1576 3.8611 2.4261 1.4271 2.9789 2.7068 4.4716 2.2384 3.9813 1.7001 2.2377 2.3974 3.8114 3.8469 4.3511 4.4137 1.8853 3.0461 2.9271 4.1701 3.5260 2.4340 4.3679 3.2659 2.6104 2.7873 3.4663 2.9099 4.0450 1.6236 1.2825 1.9609 1.2832 1.3746 1.4184 1.6098 1.4448 2.0807 1.6583 2.6924 1.6537 1.5528 1.8546 1.2873 1.3873 1.4465 1.3083 1.3393 1.1959 1.2949 1.5145 1.7112 1.7832 1.1910 1.1823 1.0905 1.1040 1.0501 1.1319 1.1002 1.4266 1.4448 1.2402 1.1990 1.4067 1.4617 8.0233 1.3146 6.6558 7.4435 9.5518 3.6237 1.0816 1.0620 1.0680 1.0600 1.0341 1.0284 1.0841 1.0631 1.0990 1.1033 1.1021 1.0938 1.1016 1.1017 1.1057 1.1055 1.0779 1.0448 1.0638 1.0776 1.0783 1.0988
irintensity: 0.1804 0.3929 0.8151 0.5599 0.8840 0.9817 4.0270 0.1978 6.2283 1.7257 0.7183 9.6208 5.6465 6.9047 0.0294 2.2362 8.1846 12.7057 2.9072 2.0400 2.0848 0.6982 31.6538 0.5056 56.3885 4.6521 21.6166 2.1089 14.5470 8.1009 0.3686 19.4829 9.7935 0.6356 34.8168 4.0231 40.7986 8.7006 17.9124 111.8310 167.2680 68.1505 4.3630 21.7567 260.1200 17.8829 21.2569 16.6172 128.9047 42.4760 49.9538 31.2663 43.7918 28.3396 35.3470 2.7548 4.8310 5.9992 12.1657 4.8827 50.1224 11.0877 9.4285 38.9675 12.8723 15.9641 10.5918 56.4360 197.0883 5.8591 3.5911 1.9626 2.4894 3.9054 3.7063 3.2630 7.5789 10.3665 129.1825 22.4441 225.3567 25.3316 34.9003 28.0542 13.5122 5.3329 11.8334 25.3439 11.1334 5.2136 14.8289 13.5553 18.1171 5.3273 34.0598 17.9952 21.0224 24.6715 11.9909 38.6022 15.2315 412.2581 368.6381 23.8893 71.4545 50.7087 159.2141 180.3106 152.8344 74.6181 179.5469 248.3172 140.0388 17.1561 2.7828 29.8980 16.7847 38.3474 36.4498 29.3629 6.1295 4.5314 34.2015 13.4590 1.4462 17.1170 3.5400 9.3090 11.5050 119.4473 8.1802 20.9395 50.7641 40.7721 9.3177
temp: 298.150 k
press: 1.00000 atm
elementType: 16 8 8 8 8 8 8 8 7 7 7 7 6 6 6 6 6 6 6 6 6 6 6 6 6 1 1 1 1 1 1 1 1 1 1 1 1 1 1 1 1 1 1 1 1 1 1
symmnumber: 1
zpe: 960113.1 jmol-1
zpe.correction: 0.365688 hartree
zpe.thermalcorrener: 0.395258 hartree
zpe.thermalcorrenthalpy: 0.396202 hartree
zpe.thermalcorrgfe: 0.299004 hartree
zpe.sumelectzpe: -1650.318290 hartree
zpe.sumelectthermal: -1650.288719 hartree
zpe.sumelectthermalent: -1650.287775 hartree
zpe.sumelectthermalfe: -1650.384973 hartree
dipole: 5.3050 0.5087 0.3644
dipole: 5.3418
quadrupole: -159.8111 -146.2495 -156.1471
quadrupole: 7.8510 -8.3191 2.8058
quadrupole: -5.7419 7.8198 -2.0779 7.8510 -8.3191 2.8058
hfenergy: -1650.6839774 hartree
pointgroup: C01 [X(C13H22N4O7S1)]
dipole: 2.0175607 0.5739505 0.1300334 debye
polarizability: 268.4914052|17.9017065|178.6706453|2.961269|13.05171|183.7597556 unknown
InChI: InChI=1S/C13H22N4O7S/c1-15-13(23)25-6-8(11(20)16-5-10(19)24-2)17-9(18)4-3-7(14)12(21)22/h7-8,15-17,21H,3-6,14H2,1-2H3
charge 0 multiplicity 1
47 atoms
S  0.471604 2.046843 -0.377643
O  -2.05582 -1.249572 -1.970138
O  0.851903 -0.927982 1.927835
O  -5.932347 -1.578433 2.027416
O  -6.893634 0.454505 1.453181
O  5.173503 -0.476698 -0.345763
O  3.177921 1.785964 -1.003015
O  5.354761 0.80799 1.596807
N  -1.046937 -0.875498 0.081708
N  2.606434 -1.04827 0.403679
N  -7.142517 -0.489958 -1.177071
N  2.61003 3.425058 0.558719
C  0.305947 -0.827348 -0.472958
C  -4.633727 -0.574896 -0.748502
C  -3.484359 -1.24384 0.039123
C  -6.072512 -1.042443 -0.335481
C  -2.151184 -1.118832 -0.705223
C  0.546957 0.432949 -1.346809
C  1.278333 -0.937615 0.7292
C  -6.36341 -0.622676 1.101239
C  3.666488 -1.002998 1.422461
C  2.324629 2.40672 -0.309553
C  4.811249 -0.108785 0.945004
C  3.988751 3.90941 0.762171
C  6.139311 0.406841 -1.047678
H  0.446459 -1.697566 -1.149739
H  -4.575863 0.527682 -0.664673
H  -4.500489 -0.830213 -1.81706
H  -3.402944 -0.837712 1.063528
H  -3.703478 -2.325701 0.147232
H  -6.093188 -2.147892 -0.373493
H  -1.094047 -0.814436 1.107056
H  -0.238284 0.483172 -2.115646
H  1.54055 0.424285 -1.831464
H  2.913741 -0.986999 -0.570597
H  -7.444016 0.448418 -0.896264
H  -6.98274 -0.590669 -2.182147
H  3.245445 -0.601982 2.356924
H  4.063457 -2.01657 1.629764
H  -6.116569 -1.249156 2.949713
H  1.855741 3.803011 1.134281
H  4.603643 3.154302 1.283638
H  3.954522 4.833621 1.360923
H  4.458347 4.131169 -0.211456
H  5.605819 1.324937 -1.341747
H  6.463372 -0.167512 -1.926501
H  6.989051 0.64357 -0.386778
