program: Gaussian 09
title: 000180391
version: EM64L-G09RevD.01
frameworkgroup: C1[X(C21H28O2)]
method: RPBEPBE
basis: SDD
operation: Freq
keyword: #pfreq=noraman
keyword: PBEPBE/SDD
title: #p freq=noraman PBEPBE/SDD
converged: YES YES NO NO
title: Mulliken charges:
elementType: O O C C C C C C C C C C C C C C C C C C C C C H H H H H H H H H H H H H H H H H H H H H H H H H H H H
charge: -0.285031 -0.287556 0.013737 -0.625980 -0.396161 -0.411733 0.515052 -0.715240 -0.718497 -0.411459 -0.413700 -0.358808 -0.391682 0.355942 -0.287856 -0.450927 -0.290793 0.378342 -0.349905 -0.383158 -0.222334 -0.197506 -0.258278 0.208664 0.211050 0.202672 0.190777 0.226070 0.209126 0.193373 0.215240 0.216382 0.211318 0.221173 0.227121 0.213438 0.228635 0.233987 0.245589 0.243414 0.232462 0.213404 0.215068 0.215615 0.234820 0.214372 0.248795 0.245917 0.222314 0.225828 0.226909
chargesum: 0.00000
title: Mulliken charges with hydrogens summed into heavy atoms:
elementType: O O C C C C C C C C C C C C C C C C C C C C C
charge: -0.285031 -0.287556 0.222401 -0.212257 0.020687 -0.009235 0.515052 -0.072300 -0.056765 -0.182824 -0.179713 -0.113220 -0.148268 0.355942 0.158010 -0.020244 0.158399 0.378342 -0.101110 -0.137241 -0.000020 0.028321 -0.031369
polarizability: 2.69088890e+02 -9.41208169e-01 2.20569802e+02 -7.44281818e+00 -4.89287249e-01 2.10103515e+02
1716.lowfreq: -9.0813 -5.0000 -0.0009 -0.0007 -0.0003 1.5022 7.3912 20.8062 29.3073
frequency: 5.9667 20.1851 29.1038 31.0482 40.2377 49.1904 62.1038 70.0839 91.0828 104.7714 120.5946 153.4136 169.3094 183.5483 213.4791 220.5330 225.4606 233.2643 241.6402 286.2683 301.4399 326.1991 339.9694 358.1144 405.8234 411.3584 412.1546 422.3617 461.6880 463.7021 503.5766 509.5678 530.2263 579.5857 596.8714 609.9268 633.4270 691.8822 709.1781 732.3078 746.3860 758.2116 766.3203 780.5786 804.8007 813.3542 821.9306 822.6734 843.7283 848.3816 878.2657 888.6102 898.4343 932.8539 940.5589 946.2874 959.2037 961.6126 963.1153 968.8181 981.0062 983.1658 1004.2475 1004.7371 1021.7200 1027.9577 1048.1375 1056.9872 1080.3430 1082.3040 1092.0889 1117.6264 1125.4770 1132.8310 1150.3287 1166.7168 1177.9104 1178.7571 1201.0815 1202.1496 1202.5666 1214.3363 1219.0692 1226.7790 1248.4367 1258.0858 1282.7905 1286.9969 1301.0625 1311.4633 1313.8655 1331.4445 1346.0789 1356.2057 1358.1254 1372.1115 1375.8615 1385.2735 1388.1397 1391.3055 1392.2901 1416.4785 1437.8240 1443.4596 1465.9182 1468.7719 1470.3687 1474.7015 1476.1114 1479.4209 1485.2624 1486.7625 1487.2427 1495.0877 1502.0473 1583.7653 1591.4995 1612.1007 1622.8442 2941.1327 2966.2941 2966.8357 2968.6870 2969.7714 2971.4638 2973.4777 2978.9236 3008.7519 3016.9511 3021.5439 3028.6699 3032.8843 3040.6401 3065.9866 3069.6418 3070.8554 3072.7183 3073.7321 3116.6939 3123.3270 3127.2325 3135.7292 3154.8310 3158.6589 3162.3209 3163.2193 3172.2058
redmass: 5.0641 3.5198 4.2727 4.0215 3.2092 3.7006 4.4911 2.7603 4.8860 2.7728 3.0555 2.6521 3.8468 1.7376 2.6793 1.1194 2.2993 4.5526 3.3348 1.9957 2.3932 2.5945 3.0083 2.3534 3.8827 2.9629 2.9842 3.2689 3.1357 3.1905 2.8505 2.5359 2.4484 4.0753 4.1460 6.3551 6.6625 2.0399 2.8951 2.9301 1.7021 1.6710 1.9587 2.3052 1.5240 1.8064 1.3420 1.5360 1.8380 2.2574 1.9299 1.4748 3.0977 1.4020 1.6816 2.0974 1.8321 1.5805 1.8760 1.8904 1.3007 5.8656 2.1578 1.6301 2.0543 1.7949 2.1096 2.4039 1.5145 1.5420 1.8244 1.6785 2.3318 1.4428 1.9483 1.0836 1.1940 1.2448 1.5498 1.2109 1.1307 2.0172 2.9800 4.1741 1.2837 1.2252 1.1812 1.1573 1.3261 1.3022 1.3349 1.5381 1.4418 1.3490 1.4408 2.1260 1.8799 2.1695 1.2778 1.4192 2.3694 3.2696 1.0977 2.3301 1.0599 1.0789 1.5260 1.0934 1.1430 1.0583 1.0489 1.0502 1.4297 1.0700 2.2591 7.0446 6.4354 6.2127 6.4564 1.0792 1.0571 1.0602 1.0572 1.0537 1.0642 1.0406 1.0398 1.0647 1.0987 1.0988 1.1001 1.1056 1.1035 1.0994 1.0988 1.0997 1.1017 1.0999 1.0891 1.0889 1.0847 1.0890 1.0925 1.0938 1.0952 1.0952 1.1006
irintensity: 0.0301 0.1191 0.1282 0.4512 0.0976 0.1214 0.3986 0.2816 1.9422 0.0333 0.0070 2.5720 1.0241 1.8337 9.1322 0.3042 3.9878 1.9860 0.0433 0.5260 0.3926 2.1677 0.9751 1.0246 0.1542 0.0322 0.0083 0.1969 0.7918 1.8045 12.0289 2.3752 16.9856 21.0522 2.3738 0.6002 0.8479 36.4710 1.3309 18.4878 10.1346 86.7135 15.2943 3.4875 23.3832 2.8354 0.1752 1.2303 43.6921 3.4768 2.2655 12.0552 2.9894 11.0745 16.0094 71.0071 16.9521 7.7778 26.5677 6.1376 0.3088 1.8360 3.5533 7.0435 13.5940 4.9266 45.0630 0.6166 0.1852 21.1128 4.5883 4.8941 2.3541 7.8047 6.9201 11.5000 62.2821 70.7283 25.1937 46.2644 2.3734 129.5084 140.0550 143.3408 3.6883 3.5189 0.5180 7.2049 0.8093 1.6414 0.6482 1.1247 4.7499 3.2757 0.4171 5.6513 1.7974 24.7576 10.9690 10.8586 16.3349 1.1249 15.9932 3.0886 6.5698 12.6905 161.0466 5.5759 54.6119 17.0907 9.2163 3.7040 12.6027 7.6511 109.0135 6.0600 22.4822 80.0056 42.2305 13.9866 31.4707 46.8107 24.5359 23.1321 55.8121 39.8909 31.3817 15.2216 23.4709 21.5339 36.7577 26.6072 62.9437 48.4269 64.2033 61.6946 29.1173 51.4141 18.3242 21.7714 2.8377 12.3692 32.0349 17.2959 4.7646 23.5316 5.2228
temp: 298.150 k
press: 1.00000 atm
elementType: 8 8 6 6 6 6 6 6 6 6 6 6 6 6 6 6 6 6 6 6 6 6 6 1 1 1 1 1 1 1 1 1 1 1 1 1 1 1 1 1 1 1 1 1 1 1 1 1 1 1 1
symmnumber: 1
zpe: 1147490.8 jmol-1
zpe.correction: 0.437056 hartree
zpe.thermalcorrener: 0.460760 hartree
zpe.thermalcorrenthalpy: 0.461704 hartree
zpe.thermalcorrgfe: 0.379093 hartree
zpe.sumelectzpe: -965.728281 hartree
zpe.sumelectthermal: -965.704578 hartree
zpe.sumelectthermalent: -965.703633 hartree
zpe.sumelectthermalfe: -965.786244 hartree
dipole: -0.1090 -0.7159 -0.2056
dipole: 0.7528
quadrupole: -136.1937 -136.0264 -130.1518
quadrupole: 3.9529 -4.8678 1.5939
quadrupole: -2.0697 -1.9024 3.9721 3.9529 -4.8678 1.5939
hfenergy: -966.1653374 hartree
pointgroup: C01 [X(C21H28O2)]
dipole: -0.0912104 0.2761319 0.0561358 debye
polarizability: 267.6279071|10.5807524|222.6862799|1.7890205|-1.3678655|209.4480202 unknown
InChI: InChI=1S/C21H28O2/c1-3-18(4-2)17-19-11-13-21(14-12-19)23-16-8-15-22-20-9-6-5-7-10-20/h5-7,9-14,18H,3-4,8,15-17H2,1-2H3
charge 0 multiplicity 1
51 atoms
O  -1.397445 1.874977 -0.539628
O  -4.096079 -0.129484 1.013734
C  4.870782 0.048103 0.152512
C  4.365282 1.411878 -0.424093
C  4.509212 -1.126326 -0.795683
C  6.383858 0.116853 0.50883
C  2.84939 1.551434 -0.437555
C  4.857335 -2.524489 -0.239825
C  7.341306 0.317603 -0.688342
C  2.133968 1.801012 0.759693
C  2.098288 1.422278 -1.636655
C  0.725625 1.915478 0.778443
C  0.694115 1.531857 -1.642319
C  0.001635 1.776918 -0.431792
C  -2.166662 2.122777 0.694707
C  -3.643789 2.125426 0.294621
C  -4.136866 0.752961 -0.169169
C  -4.473571 -1.472134 0.84672
C  -4.904658 -2.034839 -0.3809
C  -4.4053 -2.272615 2.015003
C  -5.264573 -3.402366 -0.425667
C  -4.76713 -3.632325 1.952983
C  -5.199858 -4.207675 0.732137
H  4.326009 -0.121837 1.107652
H  4.758846 1.537096 -1.451666
H  4.806775 2.22567 0.186852
H  5.015983 -0.978947 -1.771694
H  3.422424 -1.08127 -1.00407
H  6.670233 -0.807986 1.047386
H  6.532137 0.947577 1.229622
H  4.493718 -3.320177 -0.916035
H  5.948004 -2.661233 -0.121373
H  4.388435 -2.685226 0.749848
H  7.276388 -0.518672 -1.408533
H  7.120631 1.252022 -1.236007
H  8.389806 0.376002 -0.342238
H  2.686845 1.916383 1.700768
H  2.623471 1.235796 -2.581444
H  0.213669 2.113088 1.724788
H  0.117844 1.433732 -2.567733
H  -1.966203 1.321698 1.432902
H  -1.872729 3.101609 1.125074
H  -4.249741 2.453671 1.159831
H  -3.795259 2.855315 -0.522642
H  -3.477053 0.351364 -0.96284
H  -5.17654 0.814516 -0.549616
H  -4.960688 -1.431384 -1.29152
H  -4.069131 -1.811602 2.94912
H  -5.596476 -3.835583 -1.376198
H  -4.711264 -4.245534 2.859483
H  -5.480294 -5.26519 0.687327
