program: Gaussian 09
title: 000180367
version: EM64L-G09RevD.01
frameworkgroup: C1[X(C10H16N2O2)]
method: RPBEPBE
basis: SDD
operation: Freq
keyword: #p
keyword: freq=noraman
keyword: PBEPBE/SDD
title: #p freq=noraman PBEPBE/SDD
converged: YES YES NO NO
title: Mulliken charges:
elementType: O O N N C C C C C C C C C C H H H H H H H H H H H H H H H H
charge: -0.262824 -0.204782 -0.296856 -0.333492 -0.117444 -0.318996 -0.465368 -0.457407 -0.433267 0.284151 -0.443580 -0.330706 0.143457 -0.494856 0.226282 0.270694 0.237451 0.197384 0.226648 0.239500 0.240657 0.203789 0.201321 0.228206 0.206158 0.220029 0.325639 0.269667 0.227650 0.210895
chargesum: 0.00000
title: Mulliken charges with hydrogens summed into heavy atoms:
elementType: O O N N C C C C C C C C C C
charge: -0.262824 -0.204782 -0.056199 -0.007853 0.108838 -0.048303 -0.030532 0.008741 -0.028157 0.284151 -0.009215 -0.110677 0.143457 0.213356
polarizability: 1.63737842e+02 7.43910269e+00 1.21902261e+02 -3.35222750e+00 6.55714027e-01 9.54346488e+01
1716.lowfreq: -10.7760 -5.9731 -0.0004 -0.0003 -0.0001 9.1250 37.6510 53.1165 81.3534
frequency: 37.3414 52.9811 81.3199 91.9432 121.4831 173.9369 202.3412 220.6576 230.2044 267.7741 281.0021 297.3893 362.7913 392.9565 420.2750 432.4823 470.6655 525.9782 592.0620 615.8163 692.5478 708.1962 724.6628 748.9386 784.8313 816.0477 826.5673 845.3555 871.9120 879.5949 894.5435 933.0376 961.4042 971.5344 1000.9594 1019.1605 1031.4789 1076.5518 1086.2177 1107.1157 1111.5463 1134.0625 1157.7685 1158.2365 1184.0777 1202.2807 1216.1482 1223.2329 1240.1386 1242.3512 1288.6687 1299.5674 1327.3859 1334.7421 1351.2749 1354.1930 1365.3233 1399.6430 1402.9242 1413.7219 1437.8679 1453.9620 1460.5501 1465.8938 1482.8109 1483.5199 1580.7664 1640.7491 2951.7135 2959.6978 2980.6031 2992.5993 3011.0260 3017.2631 3022.8685 3030.2635 3044.5440 3065.7340 3079.4817 3093.1008 3095.7209 3128.3519 3444.1835 3544.4600
redmass: 3.5471 4.1586 3.1402 3.1846 2.9516 1.6143 2.2873 2.5783 3.6716 3.7349 2.9831 4.6689 2.1396 3.5804 1.4481 3.1164 2.5163 2.6626 3.8913 2.0433 4.1583 2.0661 3.5838 3.4865 3.6289 3.3524 1.7616 2.9927 2.1466 2.5423 2.4835 2.7933 2.4222 4.0314 2.3518 2.5497 2.3826 2.8251 2.4150 1.2832 2.7797 2.1643 1.4255 1.1529 1.2150 1.1901 1.9099 1.3064 1.4974 1.3324 1.3644 1.3868 1.4229 1.2429 1.4010 1.3842 1.3613 1.4529 1.3494 1.3688 1.0600 1.0890 1.0905 1.0819 1.0892 1.0543 8.3165 6.8202 1.0657 1.0616 1.0303 1.0825 1.0680 1.0903 1.0974 1.0667 1.0839 1.1032 1.0894 1.1024 1.1048 1.1052 1.0749 1.0801
irintensity: 1.3359 3.9715 3.5620 0.9809 5.1206 0.9503 6.2089 4.8342 2.9083 1.9024 4.3239 12.1851 3.5596 13.3877 69.9708 8.5348 36.2898 35.9470 4.4890 72.7807 31.8964 28.2186 26.2398 5.0607 17.8689 17.2055 27.3127 3.8823 13.9519 0.4859 1.2963 2.7488 5.0290 32.4645 15.8544 6.1295 4.7772 5.4334 1.8385 9.3862 14.4486 7.0320 2.5912 7.7254 10.2036 2.0511 47.6580 11.0611 3.8078 22.2192 1.7683 1.5366 6.1994 2.1695 3.4106 2.6913 4.0532 18.8732 59.2181 74.2547 13.0927 11.3578 5.2237 5.8636 15.9154 15.9987 140.5807 31.2711 19.3435 30.8388 62.3615 62.8339 24.5256 87.9960 38.8122 32.0434 13.9034 7.5385 30.0969 27.2040 44.1348 15.4600 1.3023 17.9646
temp: 298.150 k
press: 1.00000 atm
elementType: 8 8 7 7 6 6 6 6 6 6 6 6 6 6 1 1 1 1 1 1 1 1 1 1 1 1 1 1 1 1
symmnumber: 1
zpe: 662295.0 jmol-1
zpe.correction: 0.252255 hartree
zpe.thermalcorrener: 0.266042 hartree
zpe.thermalcorrenthalpy: 0.266986 hartree
zpe.thermalcorrgfe: 0.211370 hartree
zpe.sumelectzpe: -649.440414 hartree
zpe.sumelectthermal: -649.426627 hartree
zpe.sumelectthermalent: -649.425683 hartree
zpe.sumelectthermalfe: -649.481298 hartree
dipole: 1.5715 3.5444 1.8688
dipole: 4.3041
quadrupole: -78.6073 -84.4012 -84.4730
quadrupole: 0.4390 -10.6682 0.3003
quadrupole: 3.8865 -1.9073 -1.9792 0.4390 -10.6682 0.3003
hfenergy: -649.6926688 hartree
pointgroup: C01 [X(C10H16N2O2)]
dipole: 0.6707088 -0.9988978 -1.1915487 debye
polarizability: 163.7552844|-8.1763008|117.3879759|2.5453191|9.5743282|99.931492 unknown
InChI: InChI=1S/C10H16N2O2/c1-14-12-10(13)8-4-2-3-7-5-6-9(8)11-7/h4,7,9,11-12H,2-3,5-6H2,1H3
charge 0 multiplicity 1
30 atoms
O  -2.077906 1.080677 0.951985
O  -3.884891 -0.673452 -0.393319
N  1.668118 1.287716 -1.096685
N  -2.467325 -0.594243 -0.629708
C  2.87601 0.468964 -0.807159
C  0.735206 1.157955 0.054595
C  3.124146 0.806611 0.690537
C  1.716584 1.15585 1.278208
C  2.70653 -1.054303 -1.087723
C  -0.16233 -0.092202 -0.001874
C  1.746019 -1.830232 -0.148793
C  0.296818 -1.379134 -0.095944
C  -1.636202 0.174829 0.178777
C  -4.557748 0.563918 -0.878054
H  3.71197 0.830697 -1.437074
H  0.072046 2.038181 0.102579
H  3.793808 1.67998 0.762675
H  3.608426 -0.032068 1.222989
H  1.384472 0.43864 2.047136
H  1.725461 2.155731 1.74216
H  1.237696 1.107695 -2.014282
H  3.704521 -1.534616 -1.018649
H  2.368039 -1.180104 -2.136691
H  2.155832 -1.800414 0.884494
H  1.769279 -2.898051 -0.439849
H  -0.440959 -2.195236 -0.043222
H  -2.12688 -1.332442 -1.249074
H  -4.204023 1.430662 -0.296624
H  -5.626068 0.373575 -0.688873
H  -4.374046 0.709413 -1.95894
