program: Gaussian 09
title: 000180381
version: EM64L-G09RevD.01
frameworkgroup: C1[X(C21H28O2)]
method: RPBEPBE
basis: SDD
operation: Freq
keyword: #pfreq=noraman
keyword: PBEPBE/SDD
title: #p freq=noraman PBEPBE/SDD
converged: NO YES NO NO
title: Mulliken charges:
elementType: O O C C C C C C C C C C C C C C C C C C C C C H H H H H H H H H H H H H H H H H H H H H H H H H H H H
charge: -0.290161 -0.272901 0.013343 -0.623866 -0.413147 -0.395461 0.520440 -0.717682 -0.714135 -0.377559 -0.451025 -0.402311 -0.356185 0.365859 -0.282418 -0.571268 0.493139 -0.513967 -0.485642 0.333388 -0.188857 -0.376567 -0.538872 0.206989 0.212492 0.204605 0.208472 0.194144 0.192461 0.222259 0.214160 0.227148 0.220978 0.215648 0.210221 0.217426 0.231850 0.231466 0.241615 0.245888 0.213327 0.218681 0.204077 0.234417 0.283695 0.230222 0.224048 0.250272 0.220609 0.241212 0.227476
chargesum: 0.00000
title: Mulliken charges with hydrogens summed into heavy atoms:
elementType: O O C C C C C C C C C C C C C C C C C C C C C
charge: -0.290161 -0.272901 0.220333 -0.206769 -0.010532 0.019259 0.520440 -0.055396 -0.070841 -0.145709 -0.219559 -0.160696 -0.110297 0.365859 0.149589 -0.132774 0.493139 -0.230273 -0.255420 0.333388 0.035191 -0.126294 0.150424
polarizability: 3.08005858e+02 -1.22135494e+01 2.16986661e+02 -2.51798260e+01 2.05132724e+01 1.83207822e+02
1716.lowfreq: -10.1377 -4.3540 -3.4061 -0.0006 -0.0004 0.0006 5.0827 13.7606 20.9060
frequency: -3.8992 13.7372 20.3706 35.5486 41.2613 50.0933 65.5947 87.9200 100.1466 108.7944 128.3717 149.0282 167.7999 174.1195 200.1857 206.8484 209.6933 241.2094 259.7889 268.6241 277.8789 304.0070 316.9288 340.1818 341.8745 408.8124 414.1380 420.7080 443.5122 458.6957 465.1406 511.9791 515.7699 527.7253 535.4982 579.4831 625.2721 632.7550 698.0263 703.7594 711.2418 737.8020 747.1126 771.0814 794.0848 805.1414 813.6641 820.2081 842.5095 867.0750 877.4006 884.0976 891.4850 895.1890 930.5963 944.9061 959.4445 969.2492 971.7324 976.3075 987.0812 997.6600 1003.1161 1004.4549 1015.7224 1028.2842 1056.2832 1076.4342 1082.1837 1084.6597 1113.0173 1118.2523 1132.1261 1150.3996 1156.5812 1167.9865 1172.8014 1176.4495 1189.6787 1205.6859 1214.0481 1220.3287 1243.7711 1250.4233 1253.4627 1258.0367 1282.7071 1299.4714 1305.8281 1314.5851 1332.8376 1345.5252 1347.5359 1357.7989 1366.4349 1382.8058 1387.4903 1389.7678 1391.7760 1415.7519 1426.3248 1445.5287 1452.9079 1465.6078 1466.9836 1468.5566 1469.3976 1471.1766 1474.9547 1479.3813 1483.8278 1485.0986 1485.9139 1494.0615 1500.3795 1582.8645 1602.2831 1607.8994 1623.0270 2942.2882 2955.4328 2958.6104 2964.9634 2970.4358 2972.2611 2975.1398 2980.9531 2987.0693 3019.3207 3022.3395 3023.2084 3028.8450 3045.9283 3046.7458 3066.1532 3069.2050 3070.7410 3075.9107 3118.6575 3122.0473 3122.3169 3122.6323 3144.2258 3155.8254 3162.5259 3169.7677 3176.3256
redmass: 3.8782 4.6206 3.5338 3.8020 3.3350 3.4416 2.7679 4.4478 3.2645 2.3523 3.3921 3.5547 2.6228 2.4834 1.9760 1.6098 1.2584 2.5725 2.7570 1.7858 1.9188 2.8726 2.7440 3.9002 2.3018 2.7733 2.8794 3.4888 4.1074 3.2136 3.1703 2.6949 4.0101 2.4066 4.7733 3.7585 3.7450 6.7575 4.0682 2.5025 2.7258 3.1371 1.6455 1.4674 1.5401 1.5331 2.0069 1.4416 1.9214 2.9560 1.9420 2.1170 1.7297 1.6387 1.4026 1.5124 1.3664 2.0097 1.3321 4.2712 4.2995 3.1672 1.9694 1.7868 2.4592 1.8046 2.4210 2.3476 1.5327 1.6087 1.2609 1.6844 1.4431 1.9575 1.3249 1.7805 1.1358 1.3227 1.1744 1.5894 1.9652 3.9402 1.1775 1.2793 2.9219 1.2370 1.1713 1.3010 1.2847 1.3392 1.5447 1.6411 1.4770 1.4179 1.5003 2.5481 1.2846 1.2636 6.6905 3.2885 1.6091 1.3026 1.3094 1.0501 1.0673 1.0722 1.2661 1.1427 1.0701 1.0647 1.0452 1.0593 1.8811 1.0731 2.3911 6.9393 6.7482 6.0975 6.4620 1.0793 1.0560 1.0329 1.0608 1.0441 1.0552 1.0578 1.0402 1.0635 1.0995 1.0982 1.1050 1.0994 1.1038 1.0995 1.1000 1.0993 1.0989 1.0998 1.0888 1.0902 1.0926 1.0929 1.0930 1.0950 1.0941 1.0970 1.0906
irintensity: 0.1219 0.0359 0.5939 0.2409 0.3116 0.0464 0.1865 0.9823 6.9556 0.0416 0.7046 1.2803 4.0311 1.2133 0.6525 1.3699 0.1911 0.2207 1.0489 0.3766 0.2346 3.9282 1.1921 1.4810 0.7150 0.9852 0.3897 0.7545 0.4924 3.5338 1.8074 0.0337 0.9643 20.7456 6.0568 13.3061 6.3202 0.1407 12.4455 11.5098 10.7731 20.9525 13.8378 1.2386 45.6405 35.6478 4.2922 0.8635 31.9778 13.7293 0.9741 10.7954 8.0781 48.8753 8.5275 6.8582 0.6033 3.4280 1.0767 1.2417 2.0740 66.7644 2.2272 6.5159 18.5684 5.0270 0.4097 7.9533 5.7541 16.6302 0.3014 4.6261 5.6459 7.6165 1.1323 44.8376 14.7613 86.4930 22.8062 15.7115 91.7925 151.2595 16.6267 3.4817 81.3593 4.7935 1.2920 2.3079 6.2339 0.0767 1.0689 6.5690 6.8148 0.2843 15.3400 15.0555 14.8633 21.6845 8.4884 3.5018 18.6094 6.2299 17.9653 11.5163 6.6013 10.4744 75.4906 62.9473 2.2966 13.3520 5.1762 14.1266 16.2377 8.9281 128.9285 14.1363 30.1369 83.5212 44.7084 15.6133 35.5208 54.0610 43.7394 31.5164 16.1324 64.8648 25.7632 17.3553 15.6739 25.6267 59.3659 36.5296 46.0394 23.4969 61.7980 57.5464 49.3061 60.3043 13.3623 32.1808 26.8536 5.0570 24.9186 12.7161 10.0304 13.5261 3.7638
temp: 298.150 k
press: 1.00000 atm
elementType: 8 8 6 6 6 6 6 6 6 6 6 6 6 6 6 6 6 6 6 6 6 6 6 1 1 1 1 1 1 1 1 1 1 1 1 1 1 1 1 1 1 1 1 1 1 1 1 1 1 1 1
symmnumber: 1
zpe: 1145405.9 jmol-1
zpe.correction: 0.436262 hartree
zpe.thermalcorrener: 0.459434 hartree
zpe.thermalcorrenthalpy: 0.460379 hartree
zpe.thermalcorrgfe: 0.381254 hartree
zpe.sumelectzpe: -965.726952 hartree
zpe.sumelectthermal: -965.703780 hartree
zpe.sumelectthermalent: -965.702836 hartree
zpe.sumelectthermalfe: -965.781961 hartree
dipole: -1.7464 -1.2677 -0.2361
dipole: 2.1709
quadrupole: -141.8540 -136.3499 -135.8327
quadrupole: -9.4016 -4.1994 8.5282
quadrupole: -3.8418 1.6623 2.1795 -9.4016 -4.1994 8.5282
hfenergy: -966.1632144 hartree
pointgroup: C01 [X(C21H28O2)]
dipole: 0.7139081 0.4644539 -0.0640985 debye
polarizability: 299.4896741|-8.9605897|212.4573006|39.2259857|-25.8689933|196.2533657 unknown
InChI: InChI=1S/C21H28O2/c1-4-17(5-2)15-19-9-11-20(12-10-19)23-14-13-18-7-6-8-21(16-18)22-3/h6-12,16-17H,4-5,13-15H2,1-3H3
charge 0 multiplicity 1
51 atoms
O  -1.32438 1.611736 0.261236
O  -4.219108 -2.577675 0.297419
C  4.79252 -0.718667 0.70347
C  4.379983 0.789721 0.721705
C  6.22438 -0.913712 1.281833
C  4.604639 -1.329668 -0.71076
C  2.884545 1.024445 0.55916
C  7.366069 -0.26973 0.461288
C  4.849853 -2.852829 -0.781407
C  1.981664 0.670053 1.600515
C  2.338232 1.593146 -0.615237
C  0.596208 0.873732 1.473416
C  0.947086 1.807305 -0.766029
C  0.072354 1.444267 0.285836
C  -1.920354 2.239999 -0.935401
C  -3.441523 2.304882 -0.722667
C  -4.183347 0.987769 -0.927152
C  -3.817847 -0.166591 -0.184436
C  -5.249835 0.906151 -1.854229
C  -4.51278 -1.382613 -0.381307
C  -5.944252 -0.315337 -2.037569
C  -5.583319 -1.462508 -1.307948
C  -3.10969 -2.554955 1.253764
H  4.09792 -1.254656 1.387821
H  4.928672 1.324321 -0.077886
H  4.718308 1.225628 1.684367
H  6.426965 -1.997303 1.390483
H  6.241303 -0.49534 2.309398
H  5.27627 -0.811562 -1.425686
H  3.571765 -1.112868 -1.047158
H  8.341568 -0.437819 0.953757
H  7.229768 0.822426 0.359129
H  7.429847 -0.698773 -0.555451
H  4.623383 -3.243909 -1.790497
H  4.205173 -3.390638 -0.060164
H  5.899722 -3.111808 -0.551546
H  2.3746 0.237249 2.529118
H  3.010341 1.880231 -1.43333
H  -0.095901 0.613584 2.280989
H  0.568542 2.251439 -1.691227
H  -1.501656 3.261701 -1.046429
H  -1.669531 1.644546 -1.836387
H  -3.846047 3.06021 -1.422924
H  -3.614263 2.694412 0.300167
H  -2.98953 -0.08941 0.524505
H  -5.540077 1.792519 -2.430672
H  -6.7703 -0.371494 -2.755445
H  -6.103933 -2.416472 -1.435058
H  -3.309074 -1.851245 2.085558
H  -3.045321 -3.581729 1.643273
H  -2.156908 -2.279959 0.760692
