program: Gaussian 09
title: 000180363
version: EM64L-G09RevD.01
frameworkgroup: C1[X(C11H17NO2)]
method: RPBEPBE
basis: SDD
operation: Freq
keyword: #p
keyword: freq=noraman
keyword: PBEPBE/SDD
title: #p freq=noraman PBEPBE/SDD
converged: YES YES NO NO
title: Mulliken charges:
elementType: O O N C C C C C C C C C C C H H H H H H H H H H H H H H H H H
charge: -0.294345 -0.258405 -0.077437 -0.067267 -0.319610 -0.508906 -0.498796 -0.428692 0.392779 -0.460785 -0.656739 -0.301362 0.095434 -0.500837 0.220538 0.275493 0.232679 0.214554 0.233899 0.237530 0.192797 0.224271 0.220155 0.213572 0.226401 0.192311 0.236556 0.253968 0.227268 0.240601 0.242374
chargesum: 0.00000
title: Mulliken charges with hydrogens summed into heavy atoms:
elementType: O O N C C C C C C C C C C C
charge: -0.294345 -0.258405 -0.077437 0.153271 -0.044117 -0.061672 -0.027367 -0.011625 0.392779 -0.027059 -0.001471 -0.047394 0.095434 0.209406
polarizability: 1.52735852e+02 -1.11648204e+01 1.32701502e+02 1.57662182e-01 -2.20786116e+00 9.74892535e+01
1716.lowfreq: -20.7140 -11.8165 0.0003 0.0005 0.0006 10.8515 40.7693 62.3344 100.6293
frequency: 40.5679 62.2609 100.6129 109.8760 132.7316 152.4691 174.6249 207.0090 231.3781 257.7696 287.7125 301.6339 326.9796 335.9047 370.9743 434.8572 467.6573 524.7878 561.1747 658.8498 696.4358 707.2388 724.8833 760.5772 770.3927 819.9944 844.2372 868.8963 882.5337 894.6621 923.3157 936.4933 985.0067 994.6339 1012.9130 1030.6776 1057.6386 1069.9106 1096.9261 1113.8903 1118.7687 1138.3248 1148.5511 1153.9829 1161.0446 1188.9327 1201.3209 1211.1704 1237.3055 1253.6623 1267.2258 1285.7274 1300.1744 1320.7616 1337.4980 1355.1095 1364.1327 1381.4198 1422.4440 1432.8011 1447.8488 1449.7468 1455.8757 1464.5204 1468.3723 1469.5022 1480.2603 1487.5439 1601.4262 1654.3694 2867.7672 2943.9619 2975.9403 2997.8270 3001.3560 3014.2897 3022.4439 3024.7021 3029.7762 3050.1812 3053.9503 3075.4371 3080.8873 3090.6999 3101.8092 3108.7493 3143.3416
redmass: 4.3725 3.5878 1.1386 2.9172 2.6581 3.1732 2.9666 1.0980 2.7089 2.1358 3.6097 3.8860 2.5754 3.4318 2.8789 4.7417 4.6033 3.7231 2.6069 4.8491 3.7840 3.6183 2.6256 3.4282 2.9416 2.8430 1.9221 3.6592 2.4978 1.7372 2.8199 2.9075 3.0620 2.5794 2.0891 3.1272 1.9850 2.1097 1.7969 1.2657 1.8528 1.6379 1.4732 1.3598 1.5297 1.6520 1.6712 2.0766 1.3219 1.2877 1.4979 1.3370 1.3700 1.2815 1.4493 1.4389 1.3733 1.6790 1.1870 1.1862 1.0852 1.0501 1.0897 1.0523 1.0652 1.0611 1.0504 1.0890 9.6906 7.4714 1.0552 1.0674 1.0639 1.0612 1.0295 1.0719 1.0740 1.0751 1.0893 1.1026 1.1003 1.0984 1.1022 1.0920 1.1042 1.0901 1.1047
irintensity: 2.1463 0.0397 0.5197 1.1935 3.7803 0.6756 1.9907 0.1234 1.3440 0.6202 9.6724 3.0083 4.0752 1.2004 5.0262 4.8082 4.9798 0.6297 2.3608 14.1357 6.4807 8.0878 7.8536 5.3514 5.7406 11.8673 10.0352 25.9973 5.3666 1.1712 7.6698 14.3569 61.0772 15.1023 3.6630 44.4963 17.4191 21.2086 4.5245 0.0487 26.6262 57.5185 19.2874 20.9250 19.7141 65.0599 76.8746 111.6941 3.9328 8.6945 37.3139 2.4584 4.1217 1.6327 2.6208 4.7102 0.6845 3.6285 23.4567 2.7874 6.6850 12.9826 12.3721 10.7630 9.2618 13.3001 2.7509 28.5549 201.2237 34.7755 117.0060 21.7605 38.8309 14.4131 42.7704 57.1190 51.0021 43.7748 50.1677 11.8383 24.8755 15.0640 37.6670 29.8716 26.7558 5.0423 18.2650
temp: 298.150 k
press: 1.00000 atm
elementType: 8 8 7 6 6 6 6 6 6 6 6 6 6 6 1 1 1 1 1 1 1 1 1 1 1 1 1 1 1 1 1
symmnumber: 1
zpe: 692482.5 jmol-1
zpe.correction: 0.263753 hartree
zpe.thermalcorrener: 0.277648 hartree
zpe.thermalcorrenthalpy: 0.278593 hartree
zpe.thermalcorrgfe: 0.223183 hartree
zpe.sumelectzpe: -633.441997 hartree
zpe.sumelectthermal: -633.428101 hartree
zpe.sumelectthermalent: -633.427157 hartree
zpe.sumelectthermalfe: -633.482567 hartree
dipole: -1.8762 -1.7472 1.1574
dipole: 2.8129
quadrupole: -77.3652 -81.7041 -85.7962
quadrupole: -9.1671 1.2886 1.0652
quadrupole: 4.2567 -0.0823 -4.1744 -9.1671 1.2886 1.0652
hfenergy: -633.7057497 hartree
pointgroup: C01 [X(C11H17N1O2)]
dipole: 0.75528 -0.7093418 -0.3887393 debye
polarizability: 151.9526398|11.7046377|133.4929187|-1.8947732|-1.9355506|97.4810492 unknown
InChI: InChI=1S/C11H17NO2/c1-12-8-4-3-5-9(11(13)14-2)10(12)7-6-8/h5,8,10H,3-4,6-7H2,1-2H3
charge 0 multiplicity 1
31 atoms
O  -2.586796 -0.938127 -0.064355
O  -2.951884 1.3497 0.136196
N  1.190182 -0.874982 0.8138
C  2.415691 -0.18174 0.306131
C  0.185891 -0.764002 -0.294461
C  2.500353 -0.560953 -1.212148
C  1.017817 -0.782565 -1.644344
C  2.341068 1.345438 0.5591
C  -0.659321 0.501618 -0.147403
C  1.316843 2.145251 -0.291845
C  1.433333 -2.277377 1.229755
C  -0.141697 1.768058 -0.136305
C  -2.142809 0.396711 -0.00832
C  -4.049495 -1.118205 0.064455
H  3.290369 -0.564717 0.864854
H  -0.489154 -1.631028 -0.246285
H  3.083463 -1.491787 -1.332717
H  3.001307 0.221703 -1.8108
H  0.666421 0.003646 -2.334517
H  0.891173 -1.750148 -2.160317
H  3.344397 1.776989 0.365216
H  2.114387 1.495993 1.630584
H  1.593528 2.052227 -1.365513
H  1.432264 3.218223 -0.049606
H  2.172106 -2.289124 2.050928
H  1.809886 -2.947177 0.417359
H  0.493837 -2.70804 1.617945
H  -0.863231 2.59009 -0.025686
H  -4.207279 -2.203879 -0.006922
H  -4.574771 -0.584354 -0.745664
H  -4.399581 -0.727246 1.034782
