program: Gaussian 09
title: 000180347
version: EM64L-G09RevD.01
frameworkgroup: C1[X(C14H23NO4)]
method: RPBEPBE
basis: SDD
operation: Freq
keyword: #p
keyword: freq=noraman
keyword: PBEPBE/SDD
title: #p freq=noraman PBEPBE/SDD
converged: YES YES NO NO
title: Mulliken charges:
elementType: O O O O N C C C C C C C C C C C C C C H H H H H H H H H H H H H H H H H H H H H H H
charge: -0.346558 -0.428466 -0.311963 -0.237808 -0.203086 -0.087073 -0.068551 -0.513834 -0.480635 -0.172990 -0.434795 -0.419824 -0.391872 0.301118 0.157562 0.365668 -0.728144 -0.727705 -0.712618 0.288876 0.266590 0.215657 0.245620 0.235036 0.214370 0.243861 0.204930 0.226544 0.235352 0.211818 0.197873 0.204369 0.374126 0.244230 0.205059 0.265237 0.221363 0.240345 0.205857 0.273243 0.206233 0.214982
chargesum: 0.00000
title: Mulliken charges with hydrogens summed into heavy atoms:
elementType: O O O O N C C C C C C C C C C C C C C
charge: -0.346558 -0.054340 -0.311963 -0.237808 -0.203086 0.201804 0.198039 -0.052557 -0.031228 0.070871 -0.003321 0.027346 0.010370 0.301118 0.157562 0.365668 -0.013618 -0.060140 -0.018159
polarizability: 1.89628077e+02 -6.26749789e+00 1.56878519e+02 -3.04746546e+00 -4.61321854e+00 1.45419751e+02
1716.lowfreq: -11.3608 -7.5343 -0.0007 -0.0006 0.0002 19.3168 33.5729 38.7271 54.2981
frequency: 33.4006 38.6146 54.2658 71.4355 86.1730 105.0702 114.3849 137.6457 164.3088 190.2899 193.9555 222.3357 236.2635 242.1731 259.6356 279.7823 291.6652 310.0370 324.4836 336.2433 373.5991 386.3264 406.9699 426.3609 438.6648 475.8319 478.9270 522.7696 538.6947 590.7347 594.9478 659.1145 700.4502 717.0143 728.6548 736.7500 758.1935 796.9969 808.1581 823.4320 832.9293 869.8301 894.3949 917.2519 920.3109 929.4073 945.4111 958.1230 970.2519 985.1385 1003.6514 1032.8429 1035.0387 1044.4692 1046.3749 1064.6089 1074.6316 1105.3533 1115.5266 1157.6398 1170.1310 1177.7383 1186.4358 1211.3982 1219.5244 1238.8015 1250.2922 1258.7663 1260.8836 1270.4150 1283.6692 1285.0641 1304.5399 1310.2101 1322.5899 1325.8925 1327.2283 1346.1933 1359.7125 1371.7190 1372.4671 1374.7485 1387.2077 1397.4677 1445.4409 1459.3813 1466.4562 1467.7607 1468.5502 1472.1083 1473.5460 1475.8294 1481.9186 1491.8708 1505.0407 1618.5681 1655.4087 2970.7119 2977.8329 2985.8544 2987.4874 2988.9501 2992.7860 2995.0217 3010.6121 3022.6850 3025.2613 3038.0870 3050.7529 3053.6688 3060.5448 3075.7539 3078.4749 3083.0982 3088.6952 3092.8123 3093.4413 3112.8416 3117.6260 3520.9023
redmass: 3.7533 3.6917 5.1392 4.8975 8.7929 3.2184 2.2226 3.9707 4.4609 1.1811 2.6333 2.7508 2.9948 1.1068 1.0703 3.2052 3.3261 3.7829 3.5340 2.5970 4.0117 2.4264 2.4320 3.7958 2.9216 2.9591 2.6602 2.5027 3.0509 3.4559 1.6926 2.8317 10.7002 4.0987 5.1854 2.5329 4.8901 2.3764 3.0347 1.8963 2.8568 2.3324 3.1413 1.5958 1.6446 2.2113 2.7511 1.2022 2.7710 2.4472 1.9282 1.4196 1.4185 3.7142 2.1779 2.1778 2.0817 1.8774 1.8437 1.7675 2.2211 1.7732 1.4493 1.1923 1.4442 1.4225 1.4246 2.4703 1.9739 2.1511 1.2989 1.4492 1.5650 1.6017 1.6813 1.2866 1.5194 1.4362 1.5721 1.4724 1.2324 1.2467 2.1820 1.2171 1.0470 1.0862 1.0618 1.0776 1.0710 1.0850 1.0517 1.0838 1.0517 1.0888 1.0560 9.8982 8.7362 1.0607 1.0635 1.0350 1.0361 1.0822 1.0366 1.0645 1.0598 1.0636 1.0957 1.1011 1.0876 1.1001 1.1010 1.0922 1.0992 1.0992 1.1016 1.0990 1.1007 1.1005 1.0992 1.0640
irintensity: 1.2321 0.4537 0.0129 3.9372 0.4926 0.6677 0.4868 0.4298 0.2929 0.1749 1.6672 1.3884 2.9789 0.3446 0.0875 1.0167 0.2587 11.5293 2.6075 2.8170 0.7093 0.6227 4.8792 12.2770 1.2009 3.3607 2.9798 29.5042 19.1335 38.9000 81.8232 38.3248 18.7356 4.6734 1.5839 7.1566 4.8496 15.0777 3.2065 15.4790 26.5709 5.9929 9.0773 0.8802 3.6882 43.3867 50.7650 0.1436 41.4782 28.5555 7.0808 1.5817 0.9538 153.3772 147.9547 79.0162 6.7112 3.2386 11.6610 30.9746 160.8491 91.4065 8.9801 7.7542 11.5651 5.3562 11.7269 28.3818 17.7486 15.0346 15.4630 4.1882 24.7801 23.1787 69.4944 3.1025 48.3693 0.3983 29.1173 11.2837 45.4364 33.7640 147.5089 62.9056 0.8017 7.7479 1.0817 23.6026 27.2336 7.5281 1.7728 7.2726 4.0442 15.2624 31.2218 309.4146 252.0288 22.5635 40.4760 12.3512 24.3889 7.2673 31.4198 14.1692 23.6540 41.6893 50.2776 50.8637 28.1987 37.7502 0.6972 8.0665 10.5414 7.8309 47.0558 65.6949 28.9036 3.5973 12.4115 17.9384
temp: 298.150 k
press: 1.00000 atm
elementType: 8 8 8 8 7 6 6 6 6 6 6 6 6 6 6 6 6 6 6 1 1 1 1 1 1 1 1 1 1 1 1 1 1 1 1 1 1 1 1 1 1 1
symmnumber: 1
zpe: 935939.2 jmol-1
zpe.correction: 0.356480 hartree
zpe.thermalcorrener: 0.376084 hartree
zpe.thermalcorrenthalpy: 0.377028 hartree
zpe.thermalcorrgfe: 0.308981 hartree
zpe.sumelectzpe: -901.473690 hartree
zpe.sumelectthermal: -901.454087 hartree
zpe.sumelectthermalent: -901.453142 hartree
zpe.sumelectthermalfe: -901.521190 hartree
dipole: 1.7544 1.5361 -1.9450
dipole: 3.0365
quadrupole: -99.0109 -120.4102 -115.6464
quadrupole: -3.3008 2.6398 -1.3581
quadrupole: 12.6783 -8.7210 -3.9572 -3.3008 2.6398 -1.3581
hfenergy: -901.8301706 hartree
pointgroup: C01 [X(C14H23N1O4)]
dipole: 0.6950242 0.5456191 -0.8040292 debye
polarizability: 189.3041384|-7.1461276|156.5931957|-3.141465|-5.1211221|146.0290127 unknown
InChI: InChI=1S/C14H23NO4/c1-14(2,3)19-13(18)15-9-5-4-6-10(12(16)17)11(15)8-7-9/h9-11,16H,4-8H2,1-3H3
charge 0 multiplicity 1
42 atoms
O  -1.491082 -0.340976 -0.394347
O  -0.380031 2.881688 -1.285431
O  -0.80285 -2.361621 0.651999
O  -0.770246 2.5954 0.982185
N  0.712688 -0.924517 -0.394643
C  1.07477 0.325614 -1.088993
C  1.913768 -1.733991 -0.068072
C  2.418517 -0.037671 -1.807315
C  2.83996 -1.445141 -1.27968
C  1.225974 1.541606 -0.084514
C  2.513773 -1.320699 1.299868
C  1.678012 1.151181 1.345864
C  2.883903 0.17894 1.439133
C  -0.549058 -1.30012 0.014123
C  -0.059666 2.357572 -0.019188
C  -2.948001 -0.478086 0.029453
C  -3.033419 -0.45146 1.568647
C  -3.578239 0.785276 -0.584512
C  -3.543425 -1.762044 -0.582861
H  0.292082 0.583836 -1.818416
H  1.613214 -2.794423 -0.01477
H  3.192026 0.721543 -1.60033
H  2.268116 -0.056868 -2.900111
H  2.679548 -2.209206 -2.059855
H  3.904868 -1.480481 -0.990289
H  1.976935 2.217047 -0.543008
H  3.414432 -1.941595 1.481446
H  1.780388 -1.582734 2.087616
H  0.816251 0.717127 1.886442
H  1.922577 2.08868 1.881155
H  3.66545 0.456325 0.702682
H  3.35047 0.312059 2.434763
H  -1.238157 3.381337 -1.221805
H  -2.519353 0.444197 1.959987
H  -4.094355 -0.406913 1.876839
H  -2.576337 -1.353982 2.003734
H  -3.418632 0.806181 -1.676869
H  -3.133182 1.689686 -0.134664
H  -4.665196 0.793329 -0.387316
H  -3.054624 -2.656249 -0.166039
H  -4.625324 -1.807672 -0.359333
H  -3.417245 -1.760875 -1.680477
