program: Gaussian 09
title: 000180357
version: EM64L-G09RevD.01
frameworkgroup: C1[X(C15H24N2O4)]
method: RPBEPBE
basis: SDD
operation: Freq
keyword: #p
keyword: freq=noraman
keyword: PBEPBE/SDD
title: #p freq=noraman PBEPBE/SDD
converged: YES YES NO NO
title: Mulliken charges:
elementType: O O O O N N C C C C C C C C C C C C C C C H H H H H H H H H H H H H H H H H H H H H H H H
charge: -0.398495 -0.305722 -0.274433 -0.207946 -0.164091 -0.368253 -0.074166 -0.319460 -0.493930 -0.500589 -0.420561 0.381077 -0.454259 -0.351563 0.307249 0.098465 0.346175 -0.701183 -0.719216 -0.711773 -0.507421 0.267507 0.286246 0.242799 0.217238 0.244019 0.243123 0.210818 0.233652 0.221507 0.218044 0.254167 0.411612 0.209070 0.213504 0.274074 0.230365 0.234976 0.213839 0.274342 0.218097 0.211523 0.206442 0.226745 0.276385
chargesum: 0.00000
title: Mulliken charges with hydrogens summed into heavy atoms:
elementType: O O O O N N C C C C C C C C C C C C C C C
charge: -0.398495 -0.305722 -0.274433 -0.207946 -0.164091 0.043359 0.193341 -0.033214 -0.033893 -0.013448 0.023909 0.381077 -0.014708 -0.097396 0.307249 0.098465 0.346175 -0.004535 -0.040035 -0.007811 0.202151
polarizability: 2.26920079e+02 3.78149638e+00 1.88781499e+02 6.90518661e+00 3.06439102e-01 1.48412335e+02
1716.lowfreq: -16.1872 -8.3600 -0.0009 -0.0006 -0.0003 11.1033 25.5302 34.6221 55.6638
frequency: 24.1105 34.5469 55.5876 65.0520 76.4757 86.3849 120.2936 124.8166 143.9698 150.7001 164.5230 192.4926 193.8777 207.4134 232.6241 237.8360 246.2982 261.8226 263.1790 282.2975 295.5984 312.6881 337.0290 342.0546 357.0395 388.5905 402.7917 431.7924 436.5196 450.6071 476.0152 505.7167 549.9157 603.3850 665.2754 689.4638 695.6492 715.1016 730.8701 736.4136 753.8996 758.1023 809.2838 827.4678 835.5166 841.4239 851.0623 882.0252 895.2604 915.6245 919.2542 926.1764 950.5507 953.4483 975.2681 987.5692 1006.8844 1027.2218 1031.2800 1033.5472 1044.1781 1074.3978 1094.0012 1104.0711 1123.5132 1143.0170 1158.5238 1162.4565 1170.5995 1198.0944 1212.3647 1237.1454 1244.6457 1250.8827 1255.9124 1266.9758 1278.5988 1298.7074 1305.5420 1313.9286 1323.2780 1348.4485 1351.9617 1365.0390 1376.0720 1379.8996 1387.8236 1402.3539 1404.1061 1435.6914 1447.6680 1457.3934 1458.7925 1465.6486 1467.7749 1469.6985 1471.2235 1481.6186 1486.0214 1489.1272 1497.8626 1506.6517 1589.9673 1637.1355 1655.8978 2953.7860 2976.0173 2984.2584 2988.0000 2989.4582 2994.5781 3013.9514 3031.8039 3032.3130 3048.7896 3058.7879 3069.2534 3074.6918 3078.6680 3082.0878 3089.7627 3092.6892 3095.6254 3098.4041 3111.7469 3116.5521 3121.5719 3129.0929 3327.9026
redmass: 4.0872 3.2494 3.6112 4.9665 4.9182 4.9492 4.3488 3.7595 2.4962 2.2291 2.5887 1.6313 1.5750 2.1532 2.7841 1.3213 1.8589 1.1883 2.5871 3.5364 3.5997 3.3824 3.1904 3.7977 4.6174 2.6895 2.8435 3.5633 3.1541 4.8813 2.8354 4.4671 2.6077 3.8696 1.8508 3.5842 4.1322 5.2574 3.1946 2.0661 7.0046 3.2912 3.0623 3.2080 2.0529 3.3272 4.3305 1.6405 2.5565 1.6080 1.8184 2.5430 2.8786 1.2096 3.2483 4.3273 2.3969 2.8717 1.4042 1.4358 2.7557 2.2439 2.8503 1.2874 2.0894 1.7757 1.4269 1.3455 1.9968 1.4249 1.3565 2.2024 1.3413 1.8321 3.0787 2.7136 1.6128 1.3913 1.5239 1.6405 1.2652 1.7102 1.4170 1.4420 1.2272 1.2347 2.1536 1.2185 1.1349 1.0598 1.0491 1.0840 1.0876 1.0667 1.1094 1.0811 1.0737 1.0723 1.0548 1.0871 1.2298 1.0954 5.8757 10.2275 7.4022 1.0673 1.0314 1.0621 1.0364 1.0361 1.0370 1.0596 1.0659 1.0874 1.1011 1.0896 1.0968 1.0924 1.0994 1.0991 1.1008 1.0993 1.0999 1.1040 1.0899 1.0997 1.0993 1.1054 1.0866
irintensity: 0.5515 0.4501 1.2280 5.0014 2.4411 0.8284 2.0946 4.8643 1.2233 0.5663 0.3819 1.7566 0.5383 3.6534 1.3930 0.6303 0.6590 1.4819 0.2059 4.6221 4.7318 10.3958 4.9903 1.3080 7.0879 6.0902 1.0792 1.7174 0.7826 2.4381 1.5415 8.9152 0.7773 6.1794 62.3720 26.1568 19.8510 6.8999 0.6249 18.2122 0.9595 14.1060 7.3194 2.3245 15.6060 52.9645 25.4559 10.6188 1.4600 1.1763 21.1063 69.0048 10.0549 1.0722 29.8761 134.9188 31.8558 81.6092 0.0877 0.8699 8.0548 11.7413 0.9583 7.4142 0.6927 3.9394 5.1657 6.9600 239.9126 6.9920 5.3000 43.6855 3.4105 7.4605 25.2183 27.7259 9.0895 2.9068 44.6059 88.6910 6.2852 20.7629 1.4210 6.1906 43.2557 44.3247 124.1351 64.4107 13.0457 21.7112 1.5294 9.4576 9.1218 26.2678 21.7079 6.5347 20.1988 12.1709 15.5681 17.3214 76.2937 10.4661 206.6823 381.6728 22.8588 26.5636 56.0917 34.0815 20.8766 12.2037 27.3282 23.4814 43.1108 34.6795 25.4430 25.6366 4.9440 6.3028 10.7505 15.1252 31.4302 52.5397 38.7981 37.7424 5.0285 3.4037 10.3719 12.5053 381.2024
temp: 298.150 k
press: 1.00000 atm
elementType: 8 8 8 8 7 7 6 6 6 6 6 6 6 6 6 6 6 6 6 6 6 1 1 1 1 1 1 1 1 1 1 1 1 1 1 1 1 1 1 1 1 1 1 1 1
symmnumber: 1
zpe: 988846.3 jmol-1
zpe.correction: 0.376632 hartree
zpe.thermalcorrener: 0.398731 hartree
zpe.thermalcorrenthalpy: 0.399675 hartree
zpe.thermalcorrgfe: 0.325898 hartree
zpe.sumelectzpe: -994.710123 hartree
zpe.sumelectthermal: -994.688024 hartree
zpe.sumelectthermalent: -994.687080 hartree
zpe.sumelectthermalfe: -994.760857 hartree
dipole: -0.2701 -2.7033 -0.1726
dipole: 2.7223
quadrupole: -103.5631 -148.2761 -123.5852
quadrupole: 3.5235 -3.0057 -10.4918
quadrupole: 21.5784 -23.1346 1.5562 3.5235 -3.0057 -10.4918
hfenergy: -995.0867545 hartree
pointgroup: C01 [X(C15H24N2O4)]
dipole: 0.2055594 1.0505682 -0.0339323 debye
polarizability: 226.7256737|0.449346|188.3220381|-9.5784599|1.896989|149.066201 unknown
InChI: InChI=1S/C15H24N2O4/c1-15(2,3)21-14(19)17-10-6-5-7-11(12(17)9-8-10)13(18)16-20-4/h7,10,12,16H,5-6,8-9H2,1-4H3
charge 0 multiplicity 1
45 atoms
O  -1.196671 1.130771 0.187216
O  0.059191 2.825553 -0.911592
O  -0.018759 -3.692921 -0.293966
O  -2.532542 -2.54436 0.47074
N  1.099037 1.010513 0.122804
N  -1.321894 -1.815002 0.221985
C  2.488599 1.399844 -0.225894
C  1.105746 -0.294316 0.826212
C  3.261568 0.96125 1.048752
C  2.463845 -0.256196 1.617977
C  2.97227 0.699041 -1.52576
C  1.028128 -1.467723 -0.163621
C  3.180492 -0.840999 -1.448952
C  1.957365 -1.689674 -1.137849
C  0.006303 1.744811 -0.262556
C  -0.124736 -2.446131 -0.068711
C  -2.52541 1.879119 0.027196
C  -2.846287 2.011612 -1.474261
C  -3.521713 0.947596 0.742509
C  -2.438224 3.241864 0.74274
C  -3.010228 -3.228994 -0.766541
H  2.513281 2.490999 -0.384464
H  0.25876 -0.333749 1.527989
H  3.267923 1.790117 1.777218
H  4.311049 0.70408 0.820918
H  3.00583 -1.207335 1.492743
H  2.267539 -0.126523 2.695362
H  3.939819 1.158243 -1.811414
H  2.254047 0.935107 -2.333385
H  3.973395 -1.062356 -0.701736
H  3.594476 -1.171568 -2.419621
H  1.807003 -2.586326 -1.755172
H  -1.42798 -0.787956 0.28411
H  -3.853442 2.450223 -1.598396
H  -2.841443 1.018993 -1.959642
H  -2.111025 2.659864 -1.975377
H  -3.234705 0.801009 1.798373
H  -3.584452 -0.042816 0.258553
H  -4.52768 1.402999 0.717692
H  -1.717425 3.907407 0.244505
H  -2.138287 3.106185 1.797282
H  -3.434175 3.721265 0.729056
H  -3.191322 -2.493661 -1.573439
H  -3.954314 -3.703798 -0.455958
H  -2.271055 -3.983558 -1.080129
