program: Gaussian 09
title: 000180348
version: EM64L-G09RevD.01
frameworkgroup: C1[X(C15H25NO4)]
method: RPBEPBE
basis: SDD
operation: Freq
keyword: #p
keyword: freq=noraman
keyword: PBEPBE/SDD
title: #p freq=noraman PBEPBE/SDD
converged: NO YES NO NO
title: Mulliken charges:
elementType: O O O O N C C C C C C C C C C C C C C C H H H H H H H H H H H H H H H H H H H H H H H H H
charge: -0.340288 -0.430070 -0.219584 -0.310811 -0.223603 -0.109070 0.250835 -0.033944 -0.509475 -0.515122 -0.442145 -0.453297 -0.410826 -0.754921 0.100497 0.288039 0.351769 -0.716346 -0.705207 -0.711142 0.299749 0.256338 0.237533 0.230933 0.240718 0.225209 0.215947 0.222008 0.206164 0.224273 0.214318 0.199127 0.213761 0.245929 0.237149 0.378312 0.215192 0.208268 0.273474 0.225832 0.225401 0.203836 0.271502 0.207258 0.216477
chargesum: 0.00000
title: Mulliken charges with hydrogens summed into heavy atoms:
elementType: O O O O N C C C C C C C C C C C C C C C
charge: -0.340288 -0.051759 -0.219584 -0.310811 -0.223603 0.190679 0.250835 0.222394 -0.041009 -0.049195 -0.004189 -0.022859 0.002619 -0.058081 0.100497 0.288039 0.351769 -0.019411 -0.050139 -0.015905
polarizability: 2.03924741e+02 -1.75179555e+00 1.76645052e+02 -2.61725189e+00 -2.93169632e+00 1.49703260e+02
1716.lowfreq: -13.6527 -3.9580 -0.0004 -0.0003 0.0003 10.7944 33.8874 42.4654 45.2956
frequency: 33.8268 42.2808 45.2529 53.1136 81.2754 104.2328 120.3793 132.8412 150.7649 170.2374 176.4251 191.3442 199.9723 228.3041 246.2294 248.0038 260.6710 275.9318 307.1821 311.0032 327.6510 332.1880 344.0399 382.2836 393.0114 411.2866 431.9480 438.3330 464.1106 486.9556 535.8303 571.1617 595.3489 599.7890 663.4535 692.7060 698.5988 723.2476 724.9310 753.6618 777.4312 809.4728 812.2884 825.1474 835.7687 879.6331 901.5074 910.2603 913.3167 920.6478 950.9946 954.6763 959.8536 994.1198 1018.2843 1025.8343 1028.2795 1034.0293 1040.3814 1049.9498 1073.6810 1106.9892 1121.7780 1132.7038 1152.3077 1170.4326 1173.9228 1200.5176 1216.1870 1216.4939 1240.4956 1255.1189 1258.3790 1267.4217 1269.1598 1277.2035 1289.6697 1300.3949 1312.3867 1321.2866 1330.4903 1349.7677 1354.4230 1359.4111 1371.1389 1376.3789 1383.6571 1387.4857 1398.0897 1444.2700 1460.4954 1465.0355 1466.2774 1467.3165 1469.4944 1469.9485 1470.2705 1473.9651 1480.8354 1487.2673 1493.5932 1503.5004 1612.0047 1641.2959 2977.5511 2987.4958 2988.3504 2990.1775 2992.6900 2993.4815 3000.6839 3010.3477 3022.0401 3030.2508 3043.5977 3046.1331 3054.4858 3064.3592 3078.3670 3081.8809 3083.9606 3089.4402 3093.2453 3094.4537 3095.8353 3108.0112 3114.4900 3118.1650 3513.4059
redmass: 4.0881 3.6742 6.4910 4.3670 4.8683 3.3983 1.9792 3.9266 4.2104 1.1525 1.0938 2.9046 3.3175 2.9095 1.0766 1.0629 3.1865 2.9697 2.6527 3.4367 3.4849 2.6674 3.3718 2.6352 3.2131 2.7367 2.7960 2.9568 3.2723 2.9449 4.8540 2.2297 3.4306 1.3968 2.5260 3.6641 8.3705 4.8364 5.3449 6.2167 3.0551 2.5079 1.7125 2.3703 2.0575 3.0773 2.4862 2.1930 1.5940 1.6519 2.2550 1.2032 2.2345 2.2085 2.3627 2.3722 1.4230 1.4109 2.4048 2.9347 2.0373 1.8957 1.8742 2.5396 1.5379 2.0684 3.5417 1.4499 1.6419 1.5092 1.3456 2.9980 1.6023 1.4624 1.9432 2.1708 1.3643 1.5673 1.4540 1.6082 1.3131 1.6317 1.4365 1.4213 1.2323 1.2320 1.4598 1.5263 1.2210 1.0473 1.0673 1.0587 1.0774 1.0517 1.0723 1.0635 1.0719 1.0871 1.0521 1.0788 1.0794 1.0567 9.6804 8.9767 1.0613 1.0362 1.0355 1.0624 1.0382 1.0365 1.0617 1.0598 1.0645 1.0959 1.0937 1.0960 1.0997 1.1023 1.0993 1.0990 1.1006 1.0979 1.0909 1.0994 1.1000 1.0994 1.0998 1.0991 1.0640
irintensity: 0.0637 0.2132 0.8286 1.1517 2.2825 1.0610 0.0245 0.4329 0.5378 0.7359 0.0634 1.8557 0.2224 1.9348 0.0810 0.0740 2.2696 2.5370 2.4859 8.8657 4.9023 1.6717 0.9862 5.9548 5.5736 1.8708 1.1500 2.7862 3.0128 4.7745 12.3775 14.6343 26.2371 90.8829 8.2731 6.5828 21.6816 7.9971 10.2951 1.5810 2.8306 13.1203 3.2242 15.7075 16.7552 47.6327 28.2159 33.2887 0.7721 1.8151 40.6596 0.2969 7.7786 54.1724 182.6537 26.4571 0.0878 3.4736 87.0977 65.4003 18.6501 27.5884 8.0134 2.5150 23.3271 286.4957 37.6059 0.8762 3.7279 12.6532 11.7606 24.1181 50.1090 0.0260 7.1137 29.1258 1.5567 37.0800 23.6216 66.1091 0.0300 38.8411 22.8096 23.7680 43.9285 48.8873 86.0412 57.1764 56.4264 0.6039 4.3110 7.4867 10.0591 3.1559 27.6275 25.8515 7.8093 19.7583 4.6397 7.5234 34.4795 39.9399 450.7440 170.9766 22.9981 25.0097 12.3907 33.5543 19.5842 32.2513 31.9661 26.9403 29.1392 23.7750 26.5840 21.3474 68.4182 0.0365 10.3987 23.6934 38.1014 20.3243 29.5072 51.6766 38.3115 14.7727 3.5771 13.3883 24.1618
temp: 298.150 k
press: 1.00000 atm
elementType: 8 8 8 8 7 6 6 6 6 6 6 6 6 6 6 6 6 6 6 6 1 1 1 1 1 1 1 1 1 1 1 1 1 1 1 1 1 1 1 1 1 1 1 1 1
symmnumber: 1
zpe: 1006882.0 jmol-1
zpe.correction: 0.383501 hartree
zpe.thermalcorrener: 0.404775 hartree
zpe.thermalcorrenthalpy: 0.405719 hartree
zpe.thermalcorrgfe: 0.334106 hartree
zpe.sumelectzpe: -940.694308 hartree
zpe.sumelectthermal: -940.673034 hartree
zpe.sumelectthermalent: -940.672090 hartree
zpe.sumelectthermalfe: -940.743703 hartree
dipole: -0.3429 1.5553 -0.8007
dipole: 1.7826
quadrupole: -126.9198 -118.5601 -116.0430
quadrupole: -9.8912 -2.2966 -0.7948
quadrupole: -6.4121 1.9476 4.4646 -9.8912 -2.2966 -0.7948
hfenergy: -941.0778092 hartree
pointgroup: C01 [X(C15H25N1O4)]
dipole: -0.1188004 -0.5945594 0.3525126 debye
polarizability: 203.8798855|2.4419838|176.2877994|2.0517451|-4.5002413|150.1053679 unknown
InChI: InChI=1S/C15H25NO4/c1-14(2,3)20-13(19)16-10-6-5-9-15(4,12(17)18)11(16)8-7-10/h10-11,17H,5-9H2,1-4H3
charge 0 multiplicity 1
45 atoms
O  -1.947024 -0.451573 0.198095
O  1.948217 -2.803936 0.784099
O  3.866225 -1.747968 0.040189
O  -2.186889 1.882115 -0.161938
N  -0.110473 0.917872 0.297513
C  0.767189 -0.191248 0.725063
C  1.636586 -0.741817 -0.480157
C  0.594834 2.226169 0.383612
C  1.605487 0.471599 1.854492
C  1.677814 1.985642 1.488984
C  2.475586 0.358319 -1.206436
C  1.181144 2.658305 -0.990016
C  1.666058 1.491046 -1.892029
C  0.710732 -1.489351 -1.483448
C  2.616093 -1.767108 0.105483
C  -1.474338 0.867191 0.08772
C  -3.428588 -0.748046 0.01746
C  -3.86895 -0.349587 -1.405882
C  -3.467786 -2.274909 0.209035
C  -4.236974 -0.021813 1.111824
H  0.15201 -1.023376 1.098811
H  -0.142695 2.982167 0.703904
H  2.607597 0.020701 1.960377
H  1.077695 0.334765 2.81439
H  1.473636 2.61418 2.372789
H  2.677436 2.264007 1.114525
H  3.074782 -0.161532 -1.978286
H  3.21785 0.782735 -0.505059
H  2.014731 3.36299 -0.797973
H  0.409495 3.222131 -1.547971
H  0.792726 1.054328 -2.411005
H  2.298004 1.929142 -2.689443
H  1.293038 -1.867286 -2.343904
H  0.20487 -2.337327 -0.994067
H  -0.06812 -0.807533 -1.861964
H  2.62504 -3.438705 1.144859
H  -3.229974 -0.844414 -2.159402
H  -4.912065 -0.675902 -1.572083
H  -3.810936 0.741078 -1.544431
H  -3.100567 -2.550843 1.212647
H  -2.834774 -2.775616 -0.544156
H  -4.504388 -2.640583 0.099072
H  -4.176128 1.070118 0.984008
H  -5.297088 -0.330169 1.053234
H  -3.855223 -0.289957 2.113261
