program: Gaussian 09
title: 000180353
version: EM64L-G09RevD.01
frameworkgroup: C1[X(C15H23NO4)]
method: RPBEPBE
basis: SDD
operation: Freq
keyword: #p
keyword: freq=noraman
keyword: PBEPBE/SDD
title: #p freq=noraman PBEPBE/SDD
converged: YES YES NO NO
title: Mulliken charges:
elementType: O O O O N C C C C C C C C C C C C C C C H H H H H H H H H H H H H H H H H H H H H H H
charge: -0.349075 -0.312355 -0.260985 -0.449723 -0.185596 -0.076509 -0.282640 -0.492545 -0.496884 -0.423092 0.421604 -0.463585 -0.297254 0.301046 -0.006295 0.347011 -0.407722 -0.712198 -0.708367 -0.711933 0.269398 0.270078 0.245334 0.213638 0.232442 0.244148 0.213537 0.241925 0.222592 0.223488 0.265949 0.221995 0.271970 0.222057 0.209322 0.270091 0.220273 0.235790 0.209882 0.272622 0.209743 0.216190 0.364634
chargesum: 0.00000
title: Mulliken charges with hydrogens summed into heavy atoms:
elementType: O O O O N C C C C C C C C C C C C C C C
charge: -0.349075 -0.312355 -0.260985 -0.085089 -0.185596 0.192889 -0.012563 -0.033573 -0.020294 0.032370 0.421604 -0.017505 -0.031305 0.301046 -0.006295 0.347011 0.086242 -0.010728 -0.042422 -0.013379
polarizability: 1.99200423e+02 -1.76964601e+01 1.84762114e+02 8.32726182e+00 -2.94838683e+00 1.53016780e+02
1716.lowfreq: -14.8821 -7.5219 0.0006 0.0007 0.0007 10.2451 26.9651 36.5590 46.8561
frequency: 26.1814 36.4846 46.7317 55.4375 79.8117 113.0536 127.0975 138.5909 152.2861 164.2735 188.8929 201.9995 230.5913 240.8349 241.9836 259.4222 264.5552 285.7338 309.7877 315.8952 335.4309 344.4010 379.6092 395.9004 407.1591 434.7456 439.1261 457.8151 471.5338 498.1024 526.0015 567.7508 636.8570 689.2647 703.8496 711.9498 733.1998 744.1903 753.7064 790.2915 817.3938 834.0847 845.5971 874.3302 888.7162 904.9164 913.8815 919.2756 942.9665 954.6060 968.8847 996.1835 1001.4023 1011.8988 1030.5889 1031.2135 1035.4682 1044.1923 1071.8202 1081.4514 1128.9808 1147.2906 1162.0547 1169.9069 1194.1627 1195.8051 1209.8113 1216.2882 1242.4509 1245.8817 1255.4519 1258.4387 1265.0778 1273.4201 1299.2749 1304.2704 1319.1308 1329.8616 1349.8780 1358.0752 1370.6131 1374.2794 1378.4554 1382.4399 1390.5331 1399.7124 1446.4887 1457.0319 1458.2177 1459.4677 1466.8957 1469.4959 1473.4382 1475.8317 1482.0083 1493.3682 1503.1701 1549.5978 1617.8303 1633.7186 2941.2676 2946.2153 2987.9406 2988.0792 2988.2578 2994.0415 3009.3027 3013.4323 3028.6961 3033.8271 3053.3705 3055.6681 3067.8789 3078.8795 3081.7739 3083.2099 3092.5809 3094.5399 3096.0535 3099.8540 3115.1722 3118.9073 3380.1278
redmass: 4.5681 5.6367 3.2902 5.8422 5.1586 3.6963 3.0335 2.7925 3.7872 2.3694 1.2375 3.2504 1.6852 1.8091 1.9380 1.1634 2.3476 3.3815 3.4608 4.7198 2.6685 5.1669 2.4997 2.9507 3.5914 2.7073 2.8849 4.1283 2.3120 2.4262 2.0330 2.3760 3.3767 3.5790 8.4574 4.3455 3.0088 5.8179 3.4268 3.5534 3.4157 1.9719 2.5493 1.4466 2.6421 3.4162 1.5971 1.6283 2.7741 1.2050 2.3389 2.2115 3.0892 2.1543 1.4549 1.4299 3.8010 3.4507 2.2803 2.1971 2.0163 1.6160 1.3574 1.9666 1.1698 1.5437 1.6483 1.3784 1.2770 1.4704 3.0349 1.8296 1.9382 2.0632 1.4758 1.4163 1.8594 1.2599 1.7096 1.4976 1.5973 1.2324 1.2380 1.5261 1.8507 1.2186 1.0476 1.0695 1.0865 1.0823 1.0545 1.0705 1.0572 1.0806 1.0535 1.0889 1.0568 6.5243 9.9117 7.0776 1.0658 1.0674 1.0373 1.0607 1.0364 1.0369 1.0923 1.0596 1.0623 1.0897 1.0995 1.0909 1.1013 1.0993 1.0991 1.0910 1.0988 1.1004 1.1005 1.0896 1.0999 1.0992 1.0636
irintensity: 1.4240 1.6452 0.2182 1.2413 2.9693 0.8733 0.8387 0.4275 0.4573 10.5760 0.6629 3.0633 0.6080 2.6319 3.4903 0.6399 2.3826 0.8806 15.7476 9.4143 4.1375 7.1598 0.5791 2.0326 5.8708 7.2779 14.0616 19.3731 18.7789 46.1014 23.1231 4.6335 20.2936 2.0154 19.9100 7.2534 1.4748 1.3650 7.7654 7.9706 6.6133 10.5428 34.7316 9.9960 7.7652 84.9148 0.5961 1.5318 31.1999 0.4328 40.7416 4.7958 53.8004 60.5331 8.1709 4.6790 96.5078 114.8618 4.2567 16.2881 1.1850 6.1854 17.0934 243.1360 11.1549 2.1261 17.3905 1.5398 35.8831 4.3515 24.9819 82.3625 20.1526 66.5110 6.0831 13.0063 131.4531 19.3042 60.7261 16.1580 17.0631 47.8962 40.0499 71.6494 153.5928 53.8852 1.1077 6.2749 10.7640 10.8017 9.1527 27.9431 7.2558 5.8934 4.3873 17.6418 42.8247 110.0753 340.9458 50.7387 46.6295 20.0066 7.9504 37.1905 24.2490 25.6260 8.2763 22.7124 40.9275 38.6686 13.0599 33.3735 2.5320 9.1324 10.2672 8.3888 70.4746 30.3780 46.8781 1.2073 2.4835 13.2316 32.4547
temp: 298.150 k
press: 1.00000 atm
elementType: 8 8 8 8 7 6 6 6 6 6 6 6 6 6 6 6 6 6 6 6 1 1 1 1 1 1 1 1 1 1 1 1 1 1 1 1 1 1 1 1 1 1 1
symmnumber: 1
zpe: 946405.1 jmol-1
zpe.correction: 0.360467 hartree
zpe.thermalcorrener: 0.381148 hartree
zpe.thermalcorrenthalpy: 0.382093 hartree
zpe.thermalcorrgfe: 0.311295 hartree
zpe.sumelectzpe: -939.480350 hartree
zpe.sumelectthermal: -939.459668 hartree
zpe.sumelectthermalent: -939.458724 hartree
zpe.sumelectthermalfe: -939.529522 hartree
dipole: 2.9900 -2.5308 -1.2352
dipole: 4.1074
quadrupole: -103.1828 -145.2852 -117.5984
quadrupole: -0.9216 -1.8095 1.5827
quadrupole: 18.8393 -23.2630 4.4237 -0.9216 -1.8095 1.5827
hfenergy: -939.8408168 hartree
pointgroup: C01 [X(C15H23N1O4)]
dipole: 0.5476884 1.4595673 0.4255091 debye
polarizability: 178.4786071|13.9872402|204.0023065|-8.2802798|-8.504747|154.4984039 unknown
InChI: InChI=1S/C15H23NO4/c1-15(2,3)20-14(19)16-10-5-4-6-11(13(18)9-17)12(16)8-7-10/h6,10,12,17H,4-5,7-9H2,1-3H3
charge 0 multiplicity 1
43 atoms
O  -1.528052 -0.337941 0.411707
O  -2.110019 1.853046 -0.304199
O  2.127118 -2.457458 -1.474966
O  1.282583 -4.050691 0.448213
N  0.031138 1.335071 0.458592
C  0.599651 2.673451 0.172851
C  1.101927 0.386174 0.837785
C  1.721146 2.781595 1.242407
C  2.145405 1.310048 1.564526
C  1.101516 2.762334 -1.292359
C  1.677861 -0.317961 -0.400891
C  2.320103 1.866328 -1.65244
C  2.180434 0.366974 -1.479143
C  -1.27314 1.018579 0.144644
C  1.700293 -1.808856 -0.464396
C  -2.92562 -0.905409 0.165474
C  1.197548 -2.635157 0.727627
C  -3.262672 -0.79296 -1.334703
C  -2.762563 -2.374323 0.594293
C  -3.942375 -0.169966 1.061854
H  -0.19254 3.427604 0.314953
H  0.682532 -0.353302 1.535107
H  1.321341 3.269499 2.147436
H  2.569173 3.39009 0.881099
H  3.167933 1.086517 1.217216
H  2.118001 1.127401 2.651826
H  1.383736 3.813948 -1.498279
H  0.252506 2.521495 -1.958813
H  3.196386 2.199032 -1.052098
H  2.593185 2.071904 -2.703845
H  2.56129 -0.260917 -2.298443
H  1.811084 -2.386589 1.621604
H  0.147732 -2.356623 0.94611
H  -2.480335 -1.281449 -1.942618
H  -4.222254 -1.304369 -1.534271
H  -3.351748 0.261034 -1.640354
H  -2.455339 -2.44309 1.652629
H  -2.009646 -2.88965 -0.027047
H  -3.725522 -2.903126 0.478187
H  -4.029017 0.888478 0.771744
H  -4.933133 -0.649958 0.960878
H  -3.63757 -0.231021 2.121949
H  1.695225 -4.127186 -0.462147
