program: Gaussian 09
title: 000180286
version: EM64L-G09RevD.01
frameworkgroup: C1[X(C13H8Cl4O)]
method: RPBEPBE
basis: SDD
operation: Freq
keyword: #p
keyword: freq=noraman
keyword: PBEPBE/SDD
title: #p freq=noraman PBEPBE/SDD
converged: YES YES NO NO
title: Mulliken charges:
elementType: Cl Cl Cl Cl O C C C C C C C C C C C C C H H H H H H H H
charge: -0.012685 0.026144 -0.009784 0.001304 -0.287072 0.439855 0.370365 -0.546716 -0.415069 0.476815 -0.341398 -0.386758 -0.082627 -0.318396 -0.090779 -0.212206 -0.114501 -0.515152 0.271063 0.268845 0.267822 0.250019 0.260980 0.221204 0.235306 0.243420
chargesum: 0.00000
title: Mulliken charges with hydrogens summed into heavy atoms:
elementType: Cl Cl Cl Cl O C C C C C C C C C C C C C
charge: -0.012685 0.026144 -0.009784 0.001304 -0.287072 0.439855 0.370365 -0.275653 -0.146224 0.476815 -0.073576 -0.136738 -0.082627 -0.318396 -0.090779 0.048774 -0.114501 0.184778
polarizability: 3.18953725e+02 -6.32125435e-02 1.94366155e+02 -1.25550607e+00 3.72927308e+00 8.04454936e+01
1716.lowfreq: -4.8068 -0.0021 -0.0012 0.0013 4.9207 5.1961 28.3550 39.6599 52.8897
frequency: 28.3509 39.6574 52.8893 76.5862 82.8312 122.3756 137.0048 158.8160 175.4217 183.2663 191.4180 203.7257 225.3706 251.4752 258.8678 315.5243 336.9975 366.3549 394.2437 424.0053 438.6186 454.2090 504.7486 528.8322 565.8372 575.1136 584.6631 646.3019 662.5963 705.3574 719.9915 724.2705 807.7743 822.1006 857.4405 870.9505 885.4645 901.9438 952.8043 976.2696 1002.5565 1020.2234 1081.1925 1108.7977 1124.8661 1149.0121 1153.1225 1183.0786 1214.2866 1254.0317 1301.0833 1328.8232 1353.6596 1386.1267 1393.9601 1425.1957 1442.5975 1459.7977 1471.3607 1475.0848 1542.5714 1564.7441 1594.0093 1596.9819 2975.5073 3073.9640 3132.1441 3149.5481 3161.3170 3165.5274 3170.1405 3173.5864
redmass: 9.9463 9.3963 6.4271 7.4225 2.9787 5.7123 1.2351 12.2536 6.5799 7.2925 9.4807 16.3583 10.3930 9.3105 7.3672 5.6033 7.3938 8.1191 9.9057 7.5818 3.2482 8.4365 6.2714 6.1083 8.3781 5.7354 5.2522 4.7060 6.7938 3.1381 5.8526 4.5008 7.5033 1.4176 6.5462 1.4605 1.4755 1.6780 1.3592 8.9954 5.1735 5.9113 2.4122 1.2355 2.4835 1.3885 1.4172 2.1530 1.6432 1.4138 2.7230 4.1005 9.9331 5.6627 2.8162 2.7785 1.3663 1.0530 1.2202 2.3759 7.0688 8.5209 6.9355 6.4263 1.0320 1.1036 1.1019 1.0888 1.0922 1.0913 1.0927 1.0962
irintensity: 0.6449 0.7916 1.5438 1.3176 3.9318 0.8624 1.0435 0.5481 0.5327 0.8495 0.4169 0.0388 0.2378 1.3421 3.1323 3.9263 1.4169 0.6516 1.5987 2.6993 8.2608 35.3138 10.7308 3.6092 4.6238 4.0660 8.0048 0.6511 18.2011 0.8222 29.6928 5.7149 47.2603 32.4873 8.2014 28.4259 13.8330 7.4608 0.5177 159.9409 14.2490 26.9933 0.8644 4.7297 61.4588 4.0995 3.7302 50.9494 32.7664 0.1908 15.7872 69.7407 2.9052 22.7879 16.8203 141.9839 21.7749 12.4816 42.9028 23.5459 114.5496 3.9094 26.0985 9.9697 67.4237 27.0734 19.7906 4.8275 1.5156 0.9917 0.7328 1.7831
temp: 298.150 k
press: 1.00000 atm
elementType: 17 17 17 17 8 6 6 6 6 6 6 6 6 6 6 6 6 6 1 1 1 1 1 1 1 1
symmnumber: 1
zpe: 447638.8 jmol-1
zpe.correction: 0.170497 hartree
zpe.thermalcorrener: 0.187804 hartree
zpe.thermalcorrenthalpy: 0.188749 hartree
zpe.thermalcorrgfe: 0.123031 hartree
zpe.sumelectzpe: -2414.354524 hartree
zpe.sumelectthermal: -2414.337216 hartree
zpe.sumelectthermalent: -2414.336272 hartree
zpe.sumelectthermalfe: -2414.401989 hartree
dipole: -0.6665 0.4012 0.9063
dipole: 1.1944
quadrupole: -147.9369 -119.9083 -135.3414
quadrupole: -12.4550 -6.0461 5.9440
quadrupole: -13.5414 14.4872 -0.9458 -12.4550 -6.0461 5.9440
hfenergy: -2414.5250206 hartree
pointgroup: C01 [X(C13H8Cl4O1)]
dipole: 0.2679486 0.1404179 -0.359604 debye
dipolederiv: -0.2728468 0.2651883 0.0706124 0.346513 -0.5698921 -0.1368302 0.103401 -0.1493386 -0.0746713 -0.8462951 -0.0314134 -0.0260944 -0.0401904 -0.055132 -0.0017483 -0.0219357 0.0100271 -0.008371 -0.2919756 0.2471549 -0.0732415 0.3848718 -0.5041611 0.143737 -0.1190011 0.1481724 -0.0778055 -0.9279906 -0.0571928 0.0379199 -0.0699832 -0.058522 0.0122507 0.0431027 0.0099147 -0.0302638 -0.7851259 -0.5522616 0.0413951 -0.5924062 -1.1334941 0.0949691 -0.04342 -0.039912 -0.3583358 0.4226009 0.0313915 -0.0005335 -0.0319547 0.1270273 0.0562943 -0.036459 0.0342806 0.0295495 0.3772204 0.0102127 -0.0128786 -0.0060892 0.0174039 -0.0324647 0.0042083 -0.0101349 0.0047948 -0.3390479 -0.2138018 -0.0329555 -0.0178121 -0.1689244 0.0627004 -0.0132598 0.06728 -0.1242776 -0.3666997 0.1497671 0.0495392 0.0916534 -0.2507113 -0.0060576 0.0934382 -0.0183571 -0.1285872 0.3573865 0.3754137 0.0412899 0.5528218 0.9957604 0.0583509 0.2200252 0.28065 0.0582648 -0.2603489 0.1447035 -0.0469283 0.0847253 -0.1656022 0.0063026 -0.0795047 0.0148429 -0.0930803 -0.1451443 -0.0260626 0.0256947 -0.0045532 -0.0059179 -0.0637729 0.0576705 -0.0566112 -0.1243076 0.2813094 -0.480056 -0.1392209 -0.4637946 0.8561819 0.2322717 -0.1900845 0.2426525 0.0602948 0.96147 0.2019135 0.0987135 -0.0373323 -0.3587554 -0.0477255 0.0291045 -0.0915348 -0.1068795 0.1560752 -0.4960197 0.1555332 -0.6079706 0.7511718 -0.2386693 0.2242713 -0.2433555 0.0409256 -0.2390359 -0.0264373 0.0084108 0.1060737 0.0278473 -0.0365293 -0.0611951 -0.0383291 -0.0676349 1.1605625 0.2204602 -0.0951256 0.1444292 -0.116759 0.0220112 -0.0760643 0.0162353 -0.0639122 0.4666977 0.2866568 -0.0670897 0.2024835 0.5164805 -0.1490238 -0.2064964 -0.3590712 0.3727319 0.0705892 0.0682825 0.0180758 0.0740404 0.0231138 -0.0415775 0.034024 -0.0334723 0.1374 0.0756549 -0.0666384 -0.0161414 -0.0710465 0.0321916 -0.0381381 -0.0264238 -0.0327519 0.1424931 0.0815066 -0.0646515 0.0218858 -0.0712172 0.0279993 0.0453823 0.0358218 0.0338365 0.1315331 0.0459099 0.086591 -0.0298473 0.0883868 0.0088819 0.0491566 -0.040281 0.0401169 0.1317272 0.0374353 -0.0429378 0.0178993 -0.0515645 0.0123013 0.0494619 0.0170816 0.0505092 0.1454988 -0.0447691 0.053108 -0.1234091 -0.0108252 0.0265467 0.0576944 -0.0105201 0.1602373 -0.0588314 -0.0390058 0.0110834 0.0931074 0.1162149 0.0457419 -0.0521908 0.0967355 0.0345195 0.0137295 0.0638671 -0.0944542 -0.0166114 -0.1154737 -0.0807781 -0.0458551 -0.0342393 -0.0704063 0.048015 unknown
polarizability: 318.3266453|-8.3422737|194.9334319|-4.3861904|-3.3519113|80.5052962 unknown
InChI: InChI=1S/C13H8Cl4O/c1-18-12-6-8(5-11(16)13(12)17)7-2-3-9(14)10(15)4-7/h2-6H,1H3
charge 0 multiplicity 1
26 atoms
Cl 3.329372 -2.918776 -0.736671
Cl 4.935202 -0.174418 0.026531
Cl -4.299691 2.26896 -0.683334
Cl -5.861776 -0.490535 0.205771
O  3.011975 2.160745 0.677693
C  0.277981 -0.285741 0.035918
C  -1.210467 -0.332422 0.075321
C  0.98101 0.911694 0.322557
C  1.026051 -1.446245 -0.294394
C  2.390497 0.962249 0.293968
C  -1.977793 0.813328 -0.263357
C  -1.901807 -1.516341 0.451442
C  2.431606 -1.400706 -0.315218
C  3.131215 -0.211066 -0.020018
C  -3.383914 0.77485 -0.226304
C  -3.308908 -1.554868 0.486904
C  -4.057095 -0.408051 0.147223
C  3.665312 2.93651 -0.402463
H  0.456636 1.824365 0.621059
H  0.5233 -2.378717 -0.564771
H  -1.486621 1.735287 -0.588122
H  -1.341857 -2.40741 0.75192
H  -3.833739 -2.466225 0.787497
H  2.916595 3.244395 -1.156966
H  4.473543 2.356745 -0.882555
H  4.085472 3.821597 0.09687
