program: Gaussian 09
title: 000180358
version: EM64L-G09RevD.01
frameworkgroup: C1[X(C17H26N2O4)]
method: RPBEPBE
basis: SDD
operation: Freq
keyword: #p
keyword: freq=noraman
keyword: PBEPBE/SDD
title: #p freq=noraman PBEPBE/SDD
converged: YES YES NO NO
title: Mulliken charges:
elementType: O O O O N N C C C C C C C C C C C C C C C C C H H H H H H H H H H H H H H H H H H H H H H H H H H
charge: -0.338605 -0.315425 -0.219338 -0.294455 -0.183895 -0.109285 -0.077945 -0.220514 -0.492214 -0.495267 -0.423853 0.390962 -0.462374 -0.339358 0.282351 0.111776 0.362027 -0.351332 -0.453309 -0.297800 -0.726990 -0.724290 -0.712795 0.261198 0.284000 0.237236 0.207912 0.230562 0.236687 0.204899 0.244051 0.216205 0.213256 0.248571 0.264752 0.244093 0.230000 0.241724 0.220273 0.235805 0.248601 0.202934 0.261484 0.213773 0.252861 0.201197 0.273097 0.203563 0.213192
chargesum: 0.00000
title: Mulliken charges with hydrogens summed into heavy atoms:
elementType: O O O O N N C C C C C C C C C C C C C C C C C
charge: -0.338605 -0.315425 -0.219338 -0.294455 -0.183895 -0.109285 0.183253 0.063485 -0.047066 -0.028018 0.025098 0.390962 -0.032912 -0.090787 0.282351 0.111776 0.362027 0.157513 0.018415 0.158278 -0.013972 -0.056458 -0.022944
polarizability: 2.25564244e+02 1.74003364e+01 2.12835303e+02 -1.53319741e+01 3.46242593e+00 1.81669913e+02
1716.lowfreq: -4.8085 -0.0006 0.0001 0.0003 3.9476 11.7752 20.6717 25.9434 34.4464
frequency: 20.5125 25.7472 34.3474 45.9354 55.3945 83.7182 94.0167 95.6389 124.6038 137.4581 144.1572 152.5006 194.6671 205.5634 206.1808 245.5159 250.4666 256.8016 262.2059 266.2024 275.7463 285.2686 305.7303 331.7871 340.2558 373.2306 384.0935 401.2711 423.5775 438.1443 463.6005 495.2696 522.7569 552.4878 598.2354 609.9147 683.3566 689.9246 703.7525 707.0489 722.8048 736.3139 760.2230 766.3489 814.1981 828.8436 838.6196 843.4675 851.9106 877.7921 887.4495 893.8452 912.9872 917.1555 921.3811 935.9106 941.1388 957.8720 965.3831 997.5927 1008.4030 1026.4653 1031.5110 1035.4400 1036.9181 1047.9907 1066.8924 1083.8755 1114.0849 1115.3693 1128.1444 1145.0352 1158.9477 1165.8668 1173.7686 1192.0261 1201.6648 1208.6177 1215.0424 1238.9738 1248.6448 1258.2802 1264.6668 1273.7866 1293.8310 1298.4753 1306.6250 1309.3247 1321.0859 1328.1228 1332.0081 1346.7815 1352.1577 1363.1337 1371.9257 1373.4304 1378.0567 1388.3864 1395.9503 1446.0507 1462.3375 1463.6861 1464.2282 1466.7928 1469.1989 1469.3591 1471.8001 1472.2043 1481.7725 1490.7114 1493.1334 1504.1116 1516.5224 1613.8973 1648.7067 2953.2192 2982.0563 2984.3300 2985.3345 2990.5138 2992.9833 3009.6272 3011.1759 3030.4166 3031.3594 3035.4880 3049.7126 3050.7522 3065.2693 3065.5481 3077.0943 3081.2405 3090.2497 3091.0960 3093.0942 3099.4618 3107.8918 3109.7810 3109.8896 3112.6109 3115.1921
redmass: 3.7331 4.1013 3.4418 3.5095 4.5650 4.7830 3.6700 4.2321 4.0094 4.8633 2.2177 3.6481 1.0360 3.4375 3.9122 2.8080 3.0049 1.1346 1.4679 1.7226 2.9417 2.9920 3.5994 2.5828 4.8661 4.1772 2.4704 3.3114 4.4736 2.9526 2.9314 4.3756 4.9593 3.5109 2.1377 3.8065 4.6222 5.0093 6.7611 2.9178 6.1136 3.4573 4.4348 4.2339 3.2009 2.6456 2.0941 1.8021 3.4221 1.5345 1.8055 2.4932 2.2726 1.5983 1.6473 2.7183 2.9868 1.2027 2.2904 2.6494 2.2795 2.2333 1.4190 2.0845 2.2250 3.6313 2.9480 2.2969 1.7655 2.3879 2.0408 1.8410 1.2261 1.3774 2.0221 1.3942 1.4388 1.2165 1.3618 1.4021 1.3700 2.8633 2.1697 1.8701 1.3001 1.4750 1.4561 1.2872 1.8794 1.3020 1.3007 1.6894 1.5234 1.5143 1.2379 1.2369 1.9303 4.8159 1.2733 1.0473 1.0829 1.0896 1.0907 1.0612 1.0846 1.0759 1.0815 1.0651 1.0549 1.0884 1.0906 1.0974 7.3213 9.9009 7.0956 1.0668 1.0629 1.0352 1.0356 1.0364 1.0647 1.0584 1.0599 1.0911 1.0625 1.0622 1.0970 1.0914 1.1059 1.1029 1.0993 1.0994 1.0994 1.1022 1.1004 1.1018 1.0896 1.0976 1.0932 1.1057 1.0994
irintensity: 2.4847 1.6539 0.2198 0.8840 1.5362 1.7612 2.1553 2.6516 0.9416 1.7637 1.3613 3.5966 0.1036 3.7713 8.7353 1.4993 1.5248 0.2234 0.5889 2.0344 19.5084 1.2574 8.3266 3.3033 5.1668 1.7411 1.8455 5.7719 3.3973 2.5764 0.3179 2.3993 3.5202 0.4025 2.8400 4.0170 15.2810 23.6325 7.8117 3.8939 8.6564 1.6920 2.0260 11.8058 2.9411 18.0018 15.6432 19.9587 35.2653 10.6787 7.9429 1.1379 3.5984 0.8156 3.0947 67.4141 19.6427 0.1904 16.9190 45.6883 22.4876 30.9761 0.4288 10.6882 16.9036 139.6985 0.8979 19.9005 11.5671 2.3091 0.4505 8.4358 3.2726 10.2253 236.5385 4.4131 6.4660 0.1834 3.9811 10.6636 4.7747 28.2240 22.4213 17.1611 6.8960 5.7706 20.9110 4.1025 92.7954 13.6608 28.5478 26.0674 12.7039 35.7594 39.2484 42.0698 121.4870 220.1755 70.5438 1.0860 9.1800 9.5289 9.5761 8.1073 2.9985 16.8134 7.2294 12.7381 5.4611 15.7179 3.3126 15.6408 144.8059 352.8586 28.6767 26.0591 42.0802 13.8633 22.3038 33.8309 53.9522 19.2187 27.0258 46.4292 37.0917 30.5687 9.0191 49.3287 13.5224 6.8107 8.2881 9.7670 60.3294 26.6192 38.0443 13.0781 24.2406 0.7615 6.8109 33.0133 12.2470
temp: 298.150 k
press: 1.00000 atm
elementType: 8 8 8 8 7 7 6 6 6 6 6 6 6 6 6 6 6 6 6 6 6 6 6 1 1 1 1 1 1 1 1 1 1 1 1 1 1 1 1 1 1 1 1 1 1 1 1 1 1
symmnumber: 1
zpe: 1080933.3 jmol-1
zpe.correction: 0.411706 hartree
zpe.thermalcorrener: 0.435079 hartree
zpe.thermalcorrenthalpy: 0.436023 hartree
zpe.thermalcorrgfe: 0.358068 hartree
zpe.sumelectzpe: -1071.978820 hartree
zpe.sumelectthermal: -1071.955448 hartree
zpe.sumelectthermalent: -1071.954503 hartree
zpe.sumelectthermalfe: -1072.032458 hartree
dipole: 4.8445 -1.9584 -2.5648
dipole: 5.8209
quadrupole: -125.0386 -125.9462 -139.8341
quadrupole: 8.6136 -10.6374 -1.8403
quadrupole: 5.2343 4.3268 -9.5611 8.6136 -10.6374 -1.8403
hfenergy: -1072.3905262 hartree
pointgroup: C01 [X(C17H26N2O4)]
dipole: -2.0357947 0.1709117 1.0348546 debye
polarizability: 207.7200592|-13.4934679|229.616761|-16.2591678|7.9418107|182.7326393 unknown
InChI: InChI=1S/C17H26N2O4/c1-17(2,3)23-16(21)19-12-6-4-7-13(14(19)9-8-12)15(20)18-10-5-11-22-18/h7,12,14H,4-6,8-11H2,1-3H3
charge 0 multiplicity 1
49 atoms
O  1.53161 0.834825 0.599267
O  3.310766 -0.722161 0.345676
O  -2.909827 0.268611 0.772073
O  -1.07927 1.293747 -2.181185
N  1.094393 -1.399642 0.65316
N  -2.210402 1.152684 -0.203327
C  1.3594 -2.840205 0.419971
C  -0.363276 -1.120982 0.591033
C  0.163444 -3.504375 1.154047
C  -0.998241 -2.45854 1.103332
C  1.431528 -3.151314 -1.099947
C  -0.754013 -0.7449 -0.848628
C  0.11321 -2.9438 -1.899163
C  -0.48499 -1.545271 -1.923274
C  2.085827 -0.452181 0.511347
C  -1.347411 0.600677 -1.138041
C  2.375353 2.05542 0.266075
C  -2.971168 2.411519 -0.403258
C  -4.12414 2.317099 0.633695
C  -3.612424 1.25563 1.630395
C  2.892332 1.933658 -1.182038
C  1.345509 3.193138 0.391546
C  3.511011 2.196272 1.299321
H  2.330327 -3.100794 0.874679
H  -0.599253 -0.285221 1.262583
H  0.445315 -3.711315 2.200986
H  -0.11586 -4.46528 0.686138
H  -1.815753 -2.77397 0.434578
H  -1.436218 -2.305508 2.103464
H  1.741381 -4.208902 -1.221097
H  2.234384 -2.52795 -1.535773
H  -0.6520 -3.650717 -1.510783
H  0.301393 -3.258457 -2.942505
H  -0.753846 -1.142385 -2.90979
H  -3.329562 2.479742 -1.445183
H  -2.302652 3.269671 -0.214041
H  -4.324368 3.284802 1.121934
H  -5.050418 1.966974 0.149068
H  -2.904831 1.685736 2.365778
H  -4.406936 0.689244 2.140791
H  2.046674 1.761313 -1.871635
H  3.393848 2.874675 -1.474327
H  3.613025 1.105846 -1.274392
H  0.923851 3.222262 1.411811
H  0.525367 3.043776 -0.33202
H  1.831278 4.163291 0.182173
H  4.210446 1.348954 1.225407
H  4.063147 3.136658 1.115325
H  3.098036 2.231748 2.323546
