program: Gaussian 09
title: 000180278
version: EM64L-G09RevD.01
frameworkgroup: C1[X(C15H11Cl6O3P)]
method: RPBEPBE
basis: SDD
operation: Freq
keyword: #p
keyword: freq=noraman
keyword: PBEPBE/SDD
title: #p freq=noraman PBEPBE/SDD
converged: YES YES NO NO
title: Mulliken charges:
elementType: Cl Cl Cl Cl Cl Cl P O O O C C C C C C C C C C C C C C C H H H H H H H H H H H
charge: 0.003613 0.003522 0.009468 0.009352 0.008523 0.008350 1.196830 -0.516658 -0.515915 -0.598680 -0.391974 -0.646790 -0.646074 0.522024 0.522189 -0.345802 -0.346339 -0.265037 -0.264906 -0.071794 -0.072545 -0.184197 -0.183857 -0.104167 -0.104104 0.299386 0.231526 0.237204 0.256599 0.231650 0.237702 0.255681 0.326415 0.326584 0.286106 0.286113
chargesum: 0.00000
title: Mulliken charges with hydrogens summed into heavy atoms:
elementType: Cl Cl Cl Cl Cl Cl P O O O C C C C C C C C C C C C C C C
charge: 0.003613 0.003522 0.009468 0.009352 0.008523 0.008350 1.196830 -0.516658 -0.515915 -0.598680 -0.092588 0.078539 0.078959 0.522024 0.522189 -0.345802 -0.346339 0.061378 0.061678 -0.071794 -0.072545 0.101909 0.102256 -0.104167 -0.104104
polarizability: 2.01034230e+02 -1.99362584e-01 3.11264350e+02 -1.40983374e-01 2.26105652e+01 2.53513209e+02
1716.lowfreq: -7.9393 -6.5206 -0.0017 0.0021 0.0022 3.7801 5.2821 9.1824 20.1261
frequency: 4.1017 8.9880 20.1249 26.4624 34.4506 50.7525 53.5655 59.8651 74.5043 93.0738 122.2264 147.3835 147.5136 162.4999 167.5764 183.7699 184.1562 188.7755 201.4588 209.4342 211.5347 222.9089 230.4588 247.3788 264.2038 271.1440 311.7301 312.7846 351.2425 352.0714 361.5365 380.6711 404.8698 414.6836 435.3101 447.8151 451.1873 491.4101 494.3734 513.6790 523.1182 593.2426 602.2957 624.4354 628.5702 629.2586 656.7664 661.5398 694.1283 695.3049 752.8992 753.5969 853.0163 854.7140 879.7855 881.6395 885.8072 887.1144 894.7692 933.9094 964.5332 1007.6190 1031.4862 1037.8399 1085.2344 1111.8406 1115.7827 1116.1643 1171.4885 1213.1654 1220.8619 1238.6440 1240.5414 1272.7862 1290.1129 1322.6803 1325.9010 1360.2310 1361.6113 1387.7510 1406.5751 1440.3551 1447.1129 1465.0663 1471.8581 1479.4358 1489.5494 1555.4988 1556.7791 1575.9269 1578.8627 2992.7247 2993.9105 3044.7882 3087.7081 3092.7022 3102.7844 3106.0686 3167.7844 3168.6560 3180.6218 3181.8253
redmass: 20.1175 19.4875 15.9104 4.9846 3.6461 5.6848 14.3091 21.0732 6.4837 8.4612 10.6373 8.6567 10.7325 18.9572 7.0472 19.3141 10.9106 9.0875 1.0550 9.3086 5.7157 3.7886 7.2519 1.4761 4.3865 8.9323 21.7508 23.8205 12.5831 5.0828 5.7756 9.0383 11.8668 4.5836 5.6713 3.2506 3.6788 7.5443 12.3224 5.0359 7.2339 8.4208 11.0011 9.1295 6.1585 9.2987 7.9389 7.5162 3.6245 3.7086 11.6493 11.1003 1.4645 1.4486 1.5495 2.7257 5.8570 1.4063 8.8445 1.1451 1.3871 4.1560 7.4711 6.9840 1.6795 1.7905 1.8883 2.5151 1.8614 6.2261 5.1783 1.2135 1.2588 1.2901 1.4085 9.1726 9.0186 10.6812 10.9948 1.1794 1.1890 2.9201 3.0050 1.0436 1.0462 1.0408 1.0481 9.2674 9.4447 8.4287 8.1001 1.0355 1.0358 1.0857 1.1007 1.0990 1.1008 1.1005 1.0935 1.0934 1.0932 1.0931
irintensity: 0.0154 0.0451 0.0146 0.0150 0.0008 1.3917 1.2671 0.1374 0.2634 0.3201 0.0109 0.1237 0.0078 0.6677 1.0878 0.4132 1.3204 0.1285 0.1918 5.1447 20.5383 1.6095 0.0351 3.4698 14.3066 13.1639 0.2297 0.1693 0.3054 4.9051 19.7842 11.1932 5.1086 3.2850 19.7068 20.6807 0.2225 16.1618 20.2750 22.5694 57.9240 23.3463 12.8343 39.4784 10.2404 13.6556 60.7624 72.0396 2.5487 1.6671 204.2588 231.9469 5.0932 1.1689 26.4375 24.0809 153.3344 26.2527 85.5704 10.5387 0.0309 40.8397 59.3000 226.6571 58.5864 36.7179 60.8835 3.2681 15.7283 104.4616 93.7855 1.9274 5.9095 10.5572 0.6104 53.3961 107.6284 7.4115 12.3309 17.5154 24.1723 161.9047 398.2199 10.6917 0.2091 16.1757 23.5853 3.6744 1.2011 15.9652 9.4569 11.7846 25.5098 2.5615 0.6955 26.1731 12.0156 17.7215 4.2931 14.0593 0.8700 0.9157
temp: 298.150 k
press: 1.00000 atm
elementType: 17 17 17 17 17 17 15 8 8 8 6 6 6 6 6 6 6 6 6 6 6 6 6 6 6 1 1 1 1 1 1 1 1 1 1 1
symmnumber: 1
zpe: 590120.6 jmol-1
zpe.correction: 0.224765 hartree
zpe.thermalcorrener: 0.252025 hartree
zpe.thermalcorrenthalpy: 0.252969 hartree
zpe.thermalcorrgfe: 0.160474 hartree
zpe.sumelectzpe: -3903.616744 hartree
zpe.sumelectthermal: -3903.589484 hartree
zpe.sumelectthermalent: -3903.588540 hartree
zpe.sumelectthermalfe: -3903.681036 hartree
dipole: -0.0198 5.1228 0.7120
dipole: 5.1720
quadrupole: -199.9141 -177.9965 -196.8806
quadrupole: -0.0335 0.0118 -11.0707
quadrupole: -8.3171 13.6006 -5.2835 -0.0335 0.0118 -11.0707
hfenergy: -3903.8415093 hartree
pointgroup: C01 [X(C15H11Cl6O3P1)]
dipole: 1.9444066 0.0150809 -0.5996781 debye
polarizability: 302.63705|0.9180106|203.6690016|-30.8696791|-11.6354034|259.5057385 unknown
InChI: InChI=1S/C15H11Cl6O3P/c1-7(2)25(22,23-14-5-10(18)8(16)3-12(14)20)24-15-6-11(19)9(17)4-13(15)21/h3-7H,1-2H3
charge 0 multiplicity 1
36 atoms
Cl 0.5402 -1.464807 -3.430067
Cl 0.79864 2.747592 -2.449801
Cl -2.521077 -3.389175 1.878111
Cl -2.155602 2.478466 3.247711
Cl -3.944615 -3.690047 -1.074184
Cl -3.458501 4.209662 0.766712
P  2.243459 -0.275906 0.57776
O  1.614795 -1.386023 -0.637401
O  1.781752 1.321657 -0.007017
O  1.771439 -0.59243 2.066328
C  4.062354 -0.279085 0.118149
C  4.634173 -1.698593 0.327237
C  4.790608 0.803941 0.944243
C  0.299807 -1.883482 -0.674187
C  0.534708 1.932444 0.213896
C  -0.320944 -2.013074 -1.94078
C  -0.032582 2.678043 -0.848401
C  -0.383919 -2.313369 0.487276
C  -0.12443 1.883343 1.464595
C  -1.677384 -2.85775 0.372149
C  -1.342108 2.568844 1.637625
C  -1.608516 -2.567214 -2.053439
C  -1.243404 3.370325 -0.669087
C  -2.289876 -2.988689 -0.892935
C  -1.901749 3.313219 0.576699
H  4.064589 -0.014818 -0.954439
H  5.701654 -1.69239 0.043463
H  4.564805 -2.009917 1.384864
H  4.116683 -2.446128 -0.297132
H  5.856485 0.80961 0.654581
H  4.732408 0.591529 2.026709
H  4.378569 1.809949 0.7578
H  0.092505 -2.211409 1.466716
H  0.311835 1.305663 2.284685
H  -2.08168 -2.666175 -3.033592
H  -1.675379 3.946394 -1.491044
