program: Gaussian 09
title: 000180246
version: EM64L-G09RevD.01
frameworkgroup: C1[X(C8H8Cl4N2)]
method: RPBEPBE
basis: SDD
operation: Freq
keyword: #p
keyword: freq=noraman
keyword: PBEPBE/SDD
title: #p freq=noraman PBEPBE/SDD
converged: YES YES NO NO
title: Mulliken charges:
elementType: Cl Cl Cl Cl N N C C C C C C C C H H H H H H H H
charge: -0.058572 0.009120 0.039376 0.055368 0.151751 0.159585 0.150739 0.660514 -0.617577 -0.693602 -0.695467 -0.333766 -0.388563 -0.382845 0.267769 0.287499 0.222378 0.232447 0.242509 0.208780 0.254089 0.228468
chargesum: 0.00000
title: Mulliken charges with hydrogens summed into heavy atoms:
elementType: Cl Cl Cl Cl N N C C C C C C C C
charge: -0.058572 0.009120 0.039376 0.055368 0.151751 0.159585 0.150739 0.660514 -0.062309 0.003733 -0.004130 -0.333766 -0.388563 -0.382845
polarizability: 1.73551021e+02 7.24798231e-01 1.48697219e+02 -1.05116634e+01 -3.09824321e+00 9.26419472e+01
1716.lowfreq: -14.3533 -5.8564 -0.0020 0.0003 0.0009 5.4959 15.9264 49.4119 52.7251
frequency: 14.0905 49.4060 52.7188 137.2123 159.0121 171.6382 177.3998 186.5600 212.3210 220.2958 232.1067 285.3553 310.9820 339.3232 360.9575 370.5900 391.4493 420.7562 463.5888 491.3301 540.0471 581.2393 584.4751 653.0308 690.0480 733.0635 769.9066 789.0095 834.0478 902.2989 930.3830 951.7526 998.9105 1014.9546 1087.9844 1129.9587 1162.8193 1186.9360 1220.9809 1240.3428 1249.8924 1278.4862 1304.4923 1384.3375 1406.7384 1415.2576 1447.2908 1464.7057 1475.7284 1484.1813 1497.3369 1507.8683 2994.7660 3000.1739 3067.1556 3082.1702 3091.3375 3134.4700 3136.5498 3165.4829
redmass: 13.3279 10.7425 10.3110 12.8954 2.7941 1.3069 11.8479 7.6782 7.4957 7.2393 4.8203 4.9048 3.7396 14.2984 4.6207 1.1090 2.7689 11.6986 3.6866 4.5127 9.0783 4.2135 11.1536 9.6770 5.9818 12.1695 10.3976 10.4194 2.9019 1.6779 1.9855 1.5896 3.8295 1.3007 1.5975 1.9873 6.9785 3.4423 3.3811 7.9085 3.1568 1.3388 5.3057 1.1778 1.1973 8.8032 1.1020 1.0731 1.0522 1.0750 1.4269 2.6929 1.0391 1.0393 1.0609 1.0987 1.0956 1.0969 1.1002 1.1066
irintensity: 0.1777 0.8622 1.1433 0.0801 0.2583 0.1008 0.1223 0.0976 0.5824 1.2476 0.2216 7.4209 3.0544 2.1647 4.1463 0.0922 0.9066 5.0826 4.6953 2.2803 0.0677 9.3198 1.0357 2.0691 25.3721 114.2542 1.6744 152.4380 0.7269 9.9322 6.0514 4.8940 2.8865 2.8759 9.1634 31.0846 6.5515 36.5253 109.7707 54.9675 98.3642 10.3858 105.9491 27.5018 31.2557 279.1865 31.7319 19.7904 0.8793 36.3369 191.9489 136.9008 9.2610 43.9085 17.4471 8.0931 45.2221 9.8694 7.6262 2.5673
temp: 298.150 k
press: 1.00000 atm
elementType: 17 17 17 17 7 7 6 6 6 6 6 6 6 6 1 1 1 1 1 1 1 1
symmnumber: 1
zpe: 386619.3 jmol-1
zpe.correction: 0.147256 hartree
zpe.thermalcorrener: 0.161874 hartree
zpe.thermalcorrenthalpy: 0.162818 hartree
zpe.thermalcorrgfe: 0.103473 hartree
zpe.sumelectzpe: -2258.314436 hartree
zpe.sumelectthermal: -2258.299817 hartree
zpe.sumelectthermalent: -2258.298873 hartree
zpe.sumelectthermalfe: -2258.358219 hartree
dipole: 3.4581 0.9656 -3.0013
dipole: 4.6796
quadrupole: -111.4128 -115.1308 -110.2797
quadrupole: 2.6670 -5.8713 -0.1284
quadrupole: 0.8617 -2.8564 1.9947 2.6670 -5.8713 -0.1284
hfenergy: -2258.4616912 hartree
pointgroup: C01 [X(C8H8Cl4N2)]
dipole: -1.4947326 0.1996359 1.0562078 debye
dipolederiv: -0.201475 0.0121652 0.0112901 0.003887 -0.182695 -0.1160094 -0.0543762 -0.0551397 -0.5557952 -0.3038568 0.2529321 -0.0086144 0.3457193 -0.6923476 0.0037763 0.0053246 0.0133679 -0.0753617 -0.1976055 -0.2225918 -0.0280086 -0.2978313 -0.712422 -0.0832599 -0.0384557 -0.0969594 -0.0469972 -0.9646282 -0.026895 -0.0233219 -0.0255553 -0.0733642 -0.0023638 -0.0168674 -0.0020051 -0.0362895 -1.3177262 0.2656832 -0.0247069 0.3656446 -0.5846392 -0.0110384 -0.038442 0.0159248 -0.0891744 -1.2418509 -0.3311542 -0.0608528 -0.4045226 -0.615149 -0.0430952 -0.0937779 -0.09231 -0.0928716 0.2576766 0.0534012 0.0333855 0.097506 0.0741085 -0.124084 -0.0112891 -0.0335445 -0.0173236 0.0401031 0.0064154 -0.0445374 -0.0298283 -0.9212523 -0.0283917 -0.005083 -0.0507831 0.0344112 0.0603775 -0.0339644 -0.0185305 -0.0821226 0.1212473 0.1728882 0.0861562 0.1355832 0.6879123 -0.1038599 -0.0152836 -0.0207375 -0.0376882 -0.0026289 0.0836154 -0.0462336 -0.034485 -0.049702 -0.0372924 -0.0432086 -0.0162088 -0.0007191 -0.0444153 -0.0100956 0.0169411 0.0067169 -0.0093679 0.895746 -0.2782241 0.0562837 -0.4233693 1.3253695 -0.0198898 0.0220709 -0.0428823 0.024601 0.8160137 0.2473015 0.0766068 0.3779415 1.3702802 0.1749476 0.0776094 0.2375341 0.0486084 2.2003016 0.0454296 0.0671386 0.0257647 0.7104169 0.0375178 0.1149093 0.0443787 0.0560282 -0.1219284 0.0111988 0.0257948 -0.0218578 0.0917167 -0.0446788 0.0281093 -0.0376234 -0.0140934 0.1672806 -0.0388657 0.0469158 0.0260916 -0.0417223 0.0203391 0.0393226 -0.0257473 -0.0263413 -0.1722899 0.029139 0.0493953 0.0148806 0.0985924 -0.0149976 0.0379688 -0.012217 0.0904508 0.0818974 0.0471105 -0.0724386 0.0294021 0.0245955 0.0845521 -0.0518087 0.0460643 -0.0736109 0.1074821 -0.0762562 -0.0356846 -0.0434074 -0.0615001 -0.0583822 -0.0464399 0.0102416 0.0983102 -0.1687664 0.0076801 0.0745895 0.0947852 0.0736448 -0.0299337 0.0812899 0.0032023 0.078855 0.1375838 0.0245759 0.0065238 -0.0321323 0.0252478 -0.0672478 -0.0128323 -0.0954835 -0.0086908 0.0668174 0.0634111 -0.0942819 0.0174115 0.0169165 0.0758314 -0.0940965 0.0661664 -0.0235576 unknown
polarizability: 174.9076267|0.2210078|147.252361|-1.672021|9.3293799|92.7301997 unknown
InChI: InChI=1S/C8H8Cl4N2/c1-8(2,3-9)4-5(10)13-7(12)14-6(4)11/h3H2,1-2H3
charge 0 multiplicity 1
22 atoms
Cl -2.205866 -0.128532 -2.416834
Cl -0.208139 2.837785 0.051647
Cl -0.027787 -2.86905 -0.354392
Cl 4.316426 0.093503 0.089217
N  1.871767 1.222425 0.063782
N  1.937224 -1.157092 -0.074756
C  -1.799579 -0.029257 0.410103
C  -0.262433 -0.041709 0.154572
C  -2.548533 0.688937 -0.745404
C  -2.082588 0.749585 1.74508
C  -2.474127 -1.417054 0.607497
C  0.530749 1.161134 0.111368
C  0.586984 -1.187504 -0.041298
C  2.52276 0.045504 0.024881
H  -3.635486 0.601739 -0.59551
H  -2.25805 1.737131 -0.879979
H  -3.174847 0.841524 1.886761
H  -1.681827 0.169933 2.595329
H  -1.651766 1.759967 1.775803
H  -3.511086 -1.231066 0.943395
H  -2.517251 -2.004569 -0.320401
H  -1.974945 -2.015433 1.386541
