program: Gaussian 09
title: 000180238
version: EM64L-G09RevD.01
frameworkgroup: C1[X(C10H12Cl2N2O2)]
method: RPBEPBE
basis: SDD
operation: Freq
keyword: #p
keyword: freq=noraman
keyword: PBEPBE/SDD
title: #p freq=noraman PBEPBE/SDD
converged: YES YES NO NO
title: Mulliken charges:
elementType: Cl Cl O O N N C C C C C C C C C C H H H H H H H H H H H H
charge: -0.004555 0.007557 -0.262517 -0.245135 0.001656 0.002067 0.132430 -0.344009 0.647846 -0.759202 -0.699201 -0.240034 -0.444406 -0.277390 0.292769 -0.745391 0.249291 0.248515 0.224482 0.246849 0.231495 0.228151 0.225541 0.239115 0.291446 0.249436 0.255742 0.247450
chargesum: 0.00000
title: Mulliken charges with hydrogens summed into heavy atoms:
elementType: Cl Cl O O N N C C C C C C C C C C
charge: -0.004555 0.007557 -0.262517 -0.245135 0.001656 0.002067 0.132430 0.153797 0.647846 -0.056376 -0.006394 0.051412 -0.444406 -0.277390 0.292769 0.007237
polarizability: 1.63960164e+02 -2.14036822e+01 1.61249811e+02 -1.17137941e+01 -7.79590463e+00 1.13799914e+02
1716.lowfreq: -12.8689 -2.1017 0.0009 0.0013 0.0017 8.7901 29.1764 34.3577 42.1280
frequency: 29.1309 34.2305 42.0660 51.7563 72.6779 95.3988 130.3307 162.0506 182.4192 199.5547 222.1720 225.3409 256.3325 313.9156 318.0515 322.4678 342.0591 347.2113 363.1650 404.3206 446.4771 459.8705 500.3522 526.2941 536.8875 563.6715 612.6219 624.6033 653.3805 751.3821 787.6672 793.3055 867.3774 906.1007 916.3027 939.1590 963.1602 992.4743 997.6303 1002.2183 1026.7393 1034.7477 1042.8996 1110.0590 1142.2117 1154.9504 1189.4407 1199.9817 1209.7767 1267.6447 1292.9663 1329.0382 1352.2648 1384.9453 1386.1856 1408.9424 1447.8193 1452.4541 1454.3280 1462.4609 1472.4145 1477.9188 1487.1297 1502.8520 1533.4349 1657.8714 2990.3053 2994.2275 3007.8743 3030.2386 3083.6129 3086.5713 3096.0710 3098.8542 3113.8706 3121.1217 3143.0594 3205.0565
redmass: 6.8378 5.0735 4.4899 1.1912 10.7353 3.4399 4.7500 6.3939 7.4188 1.3084 3.2354 3.0214 3.8691 7.6210 7.5061 1.2329 3.7259 3.0673 2.7488 3.6732 5.1472 4.8197 3.9886 3.4405 6.1421 3.2829 4.8617 7.2426 6.7792 5.6078 5.4232 4.6898 3.1918 1.8755 1.6969 1.5248 3.1974 1.8644 3.6316 2.4346 1.6854 3.4812 1.6966 3.1026 3.6521 3.4955 2.8278 2.3237 3.0748 2.2493 2.0015 2.7911 1.2686 1.2384 1.1835 1.2001 8.2919 1.0592 1.0523 1.0826 1.0747 1.0569 1.0582 1.0619 5.3459 8.9446 1.0364 1.0368 1.0379 1.0605 1.1002 1.0999 1.0987 1.0952 1.0992 1.1035 1.1020 1.0925
irintensity: 0.5969 1.8178 4.7889 0.1554 1.2275 1.9252 0.4005 0.3473 4.9585 0.5302 1.8053 2.0829 4.9267 0.8036 0.7979 0.8459 5.6356 0.6387 4.2141 2.3855 5.0925 9.5681 4.2957 3.9470 42.4569 2.3481 1.4876 4.2498 2.3675 2.7270 28.0130 6.8776 19.3630 0.8807 6.2545 14.8126 67.0184 5.3152 40.2072 71.5248 8.4024 7.5226 19.4021 183.8295 15.2193 5.8391 238.1894 89.9978 2.6514 22.7938 118.2093 44.2915 11.2773 52.6879 26.0349 18.6567 4.9131 23.5972 16.0160 1.8640 10.6441 3.1546 17.6774 17.0289 60.5596 181.6988 13.5427 24.0873 1.2273 14.6331 5.7983 38.0650 26.9012 6.3376 6.5985 7.2091 8.9241 0.1651
temp: 298.150 k
press: 1.00000 atm
elementType: 17 17 8 8 7 7 6 6 6 6 6 6 6 6 6 6 1 1 1 1 1 1 1 1 1 1 1 1
symmnumber: 1
zpe: 540759.5 jmol-1
zpe.correction: 0.205964 hartree
zpe.thermalcorrener: 0.223032 hartree
zpe.thermalcorrenthalpy: 0.223977 hartree
zpe.thermalcorrgfe: 0.159084 hartree
zpe.sumelectzpe: -1567.083758 hartree
zpe.sumelectthermal: -1567.066691 hartree
zpe.sumelectthermalent: -1567.065746 hartree
zpe.sumelectthermalfe: -1567.130639 hartree
dipole: -3.1164 -1.2450 2.6024
dipole: 4.2467
quadrupole: -132.5087 -105.6003 -105.1431
quadrupole: -3.3669 11.7557 6.6246
quadrupole: -18.0913 8.8170 9.2743 -3.3669 11.7557 6.6246
hfenergy: -1567.2897229 hartree
pointgroup: C01 [X(C10H12Cl2N2O2)]
dipole: -1.1369461 -0.2062128 -1.2067704 debye
polarizability: 158.0448202|27.5332509|148.7539261|4.0469042|-22.499712|132.2111424 unknown
InChI: InChI=1S/C10H12Cl2N2O2/c1-6(15)16-5-10(2,3)7-4-8(11)13-14-9(7)12/h4H,5H2,1-3H3
charge 0 multiplicity 1
28 atoms
Cl 0.649058 -2.090466 2.23398
Cl 3.631485 2.258687 -1.181609
O  -1.924945 0.50141 0.278215
O  -3.889431 0.37478 -0.987738
N  2.496283 -0.301449 1.642547
N  3.19524 0.660173 0.939284
C  -0.438504 -1.190247 -0.806678
C  -1.6849 -0.954907 0.095656
C  0.81847 -0.549635 -0.177677
C  -0.74126 -0.603817 -2.211161
C  -0.233414 -2.730206 -0.967098
C  1.550809 0.438776 -0.871047
C  1.387469 -0.855835 1.104348
C  2.705066 0.993307 -0.274921
C  -3.087851 1.044852 -0.301209
C  -3.210754 2.507679 0.058538
H  -2.571075 -1.40908 -0.382688
H  -1.547098 -1.357241 1.109624
H  0.072409 -0.821661 -2.926225
H  -1.664203 -1.065264 -2.601757
H  -0.909193 0.48695 -2.184122
H  0.641132 -2.931292 -1.610959
H  -1.12198 -3.168894 -1.456056
H  -0.079977 -3.242835 -0.00459
H  1.238955 0.780917 -1.857695
H  -2.231274 3.009321 0.002909
H  -3.570307 2.600284 1.099462
H  -3.93431 2.996292 -0.610035
