program: Gaussian 09
title: 000180223
version: EM64L-G09RevD.01
frameworkgroup: C1[X(C13H16O3)]
method: RPBEPBE
basis: SDD
operation: Freq
keyword: #pfreq=noraman
keyword: PBEPBE/SDD
title: #p freq=noraman PBEPBE/SDD
converged: NO YES NO NO
title: Mulliken charges:
elementType: O O O C C C C C C C C C C C C C H H H H H H H H H H H H H H H H
charge: -0.190344 -0.199520 -0.200543 -0.203358 -0.453186 -0.382330 -0.414639 -0.387950 0.164019 -0.508833 0.435902 0.200556 -0.367852 -0.369587 -0.790260 -0.179200 0.289424 0.231361 0.218419 0.240133 0.192674 0.218156 0.214767 0.213666 0.220828 0.246242 0.272672 0.274452 0.237394 0.258678 0.255415 0.262843
chargesum: 0.00000
title: Mulliken charges with hydrogens summed into heavy atoms:
elementType: O O O C C C C C C C C C C C C C
charge: -0.190344 -0.199520 -0.200543 0.086067 -0.003406 -0.142197 -0.003809 0.040483 0.164019 -0.041763 0.435902 0.200556 -0.095179 -0.095135 -0.038773 0.083642
polarizability: 1.45412134e+02 -1.25894910e+01 1.36103131e+02 4.67477379e+00 4.50539562e-01 1.29117893e+02
1716.lowfreq: -7.5404 -0.0008 0.0000 0.0003 6.4774 11.0538 36.2256 47.1505 52.9465
frequency: 34.7318 46.9918 52.6093 61.8704 74.6643 111.0108 122.9523 130.3575 163.9168 204.7164 238.3663 305.0949 314.8327 343.0208 359.5583 431.9168 442.5913 486.2095 522.4324 555.8850 586.7808 592.0804 657.3611 667.4580 721.3919 738.5736 750.1413 769.8472 794.2853 836.2771 848.0225 854.9165 873.2372 886.0033 917.9434 935.5069 963.3212 980.6868 984.1865 990.2933 1021.7265 1035.6680 1049.2202 1079.3588 1101.0663 1113.2423 1130.5589 1138.1466 1162.6796 1199.1999 1217.9942 1232.1610 1241.3875 1247.6897 1258.5909 1261.9915 1286.2668 1299.3136 1326.2881 1336.6100 1342.3469 1351.9307 1366.7582 1387.0464 1442.7768 1448.3481 1454.2490 1467.7458 1472.6949 1477.0013 1480.2084 1569.8068 1628.2157 1634.5132 2968.6983 2973.7401 2979.1218 2982.5695 2986.1018 2997.9783 3034.3859 3042.6357 3043.5982 3051.0015 3067.6782 3073.1957 3122.6861 3227.0621 3246.0619 3272.4835
redmass: 4.3160 4.7244 4.8867 6.4568 4.2491 3.4672 1.9125 1.4984 3.5835 4.5679 2.7789 4.0347 4.4989 2.1263 3.2230 3.5758 3.0741 3.1435 3.0570 2.8223 3.8302 3.6183 2.5243 3.0946 1.4042 3.2031 2.9070 1.5039 1.6815 2.8937 5.7716 2.1419 1.5087 1.9902 1.8451 2.2745 2.9383 2.4297 2.9154 2.1149 1.9048 1.7370 2.5057 1.5465 1.4772 3.3699 1.5676 1.8442 2.1112 1.2888 1.5434 1.5190 2.0833 1.5808 1.3455 1.5627 1.5359 1.3754 1.3518 1.4235 1.4963 1.3950 1.2434 2.9891 1.0652 1.0913 1.0567 1.0837 1.0825 4.5249 1.0899 5.9827 9.5040 8.2193 1.0658 1.0639 1.0393 1.0615 1.0627 1.0816 1.0949 1.0953 1.0909 1.1022 1.0936 1.0964 1.1006 1.0935 1.0990 1.1078
irintensity: 1.1161 1.0929 3.0680 5.3131 0.3318 0.3847 1.8836 0.7408 1.1863 2.1409 0.2234 1.8222 1.3576 1.0303 2.3644 1.2398 5.5023 14.6812 1.6106 5.4370 9.1473 5.3179 28.8695 1.3686 5.2748 6.1061 5.2015 66.1829 18.3242 0.7913 26.1617 0.5128 2.7056 3.9931 15.6528 7.1829 9.3536 6.1432 15.7184 3.5698 4.0465 5.8858 12.3170 9.1297 11.0389 10.5168 1.6045 24.4341 52.6195 9.8328 28.4675 15.1328 6.3026 3.3635 26.4371 37.0818 5.4250 13.9144 4.1485 1.9177 1.4813 4.3668 63.4121 4.0833 15.3164 14.4158 17.8220 10.4032 13.9170 10.5121 10.8596 1.8802 142.6237 109.1090 14.4751 24.4817 1.0967 38.8471 25.0673 16.1306 59.0246 30.4100 3.5283 56.7611 10.0429 28.2270 11.3983 0.5188 0.3317 0.0410
temp: 298.150 k
press: 1.00000 atm
elementType: 8 8 8 6 6 6 6 6 6 6 6 6 6 6 6 6 1 1 1 1 1 1 1 1 1 1 1 1 1 1 1 1
symmnumber: 1
zpe: 685961.7 jmol-1
zpe.correction: 0.261269 hartree
zpe.thermalcorrener: 0.276796 hartree
zpe.thermalcorrenthalpy: 0.277740 hartree
zpe.thermalcorrgfe: 0.217016 hartree
zpe.sumelectzpe: -729.419548 hartree
zpe.sumelectthermal: -729.404021 hartree
zpe.sumelectthermalent: -729.403077 hartree
zpe.sumelectthermalfe: -729.463801 hartree
dipole: -1.3063 1.7909 -4.0198
dipole: 4.5905
quadrupole: -88.0284 -104.4002 -95.7926
quadrupole: -0.6930 4.6389 -2.7801
quadrupole: 8.0453 -8.3265 0.2812 -0.6930 4.6389 -2.7801
hfenergy: -729.6808168 hartree
pointgroup: C01 [X(C13H16O3)]
dipole: 0.641672 0.6462313 1.5596067 debye
polarizability: 148.0767026|11.4042724|133.7838744|3.8983895|-1.3346475|128.7725804 unknown
InChI: InChI=1S/C13H16O3/c1-9(14)13(10-6-7-16-8-10)11-4-2-3-5-12(11)15/h6-8,11,13H,2-5H2,1H3
charge 0 multiplicity 1
32 atoms
O  0.693147 -2.171384 -1.490158
O  -3.10377 -1.246117 1.047106
O  -0.241011 2.655145 -1.27953
C  1.017032 0.149662 -0.789913
C  2.422301 0.815925 -0.660108
C  -0.004592 0.734714 0.240009
C  3.183749 0.379176 0.614071
C  3.32213 -1.159098 0.681168
C  1.15681 -1.37214 -0.633918
C  1.934051 -1.856671 0.589528
C  -1.315365 -0.033273 0.287725
C  -0.3489 2.212685 -0.107638
C  -2.228364 -0.262931 -0.821461
C  -1.884546 -0.641086 1.395754
C  -0.84522 3.074437 1.04246
C  -3.288886 -0.995416 -0.327331
H  0.615022 0.34935 -1.799479
H  2.313141 1.915493 -0.701198
H  3.021519 0.530874 -1.547691
H  0.430339 0.725479 1.258521
H  2.660806 0.742342 1.522737
H  4.185672 0.849199 0.62427
H  3.828703 -1.466355 1.615449
H  3.955831 -1.507123 -0.158686
H  1.347206 -1.612426 1.499759
H  2.030844 -2.954524 0.536388
H  -2.09413 0.068807 -1.849069
H  -1.588144 -0.7476 2.435943
H  0.008123 3.341437 1.697319
H  -1.299394 4.001558 0.660136
H  -1.574644 2.52308 1.661905
H  -4.194658 -1.409718 -0.759569
