program: Gaussian 09
title: 000180226
version: EM64L-G09RevD.01
frameworkgroup: C1[X(C16H20O2)]
method: RPBEPBE
basis: SDD
operation: Freq
keyword: #pfreq=noraman
keyword: PBEPBE/SDD
title: #p freq=noraman PBEPBE/SDD
converged: YES YES NO NO
title: Mulliken charges:
elementType: O O C C C C C C C C C C C C C C C C H H H H H H H H H H H H H H H H H H H H
charge: -0.199483 -0.204367 0.144069 0.159367 0.439758 -0.453048 -0.380441 -0.431797 -0.462744 -0.758274 -0.541276 0.082560 -0.721012 -0.738229 0.418319 -0.383174 -0.368268 -0.196140 0.197954 0.220230 0.252268 0.206188 0.205516 0.207871 0.215967 0.249073 0.212866 0.227350 0.274390 0.219326 0.219985 0.224824 0.218199 0.224045 0.215591 0.274844 0.268721 0.258974
chargesum: 0.00000
title: Mulliken charges with hydrogens summed into heavy atoms:
elementType: O O C C C C C C C C C C C C C C C C
charge: -0.199483 -0.204367 0.144069 0.159367 0.439758 -0.034864 -0.128173 -0.020093 -0.038906 -0.068986 -0.266887 0.082560 -0.056878 -0.080394 0.418319 -0.108330 -0.099547 0.062834
polarizability: 2.10099752e+02 -5.32111223e+00 1.65482332e+02 -3.11498934e+00 5.30595181e+00 1.29231486e+02
1716.lowfreq: -16.2242 -3.0777 -0.0008 -0.0008 0.0004 8.6017 36.8854 40.4433 78.6112
frequency: 36.7842 40.4220 78.6098 97.8630 133.4336 152.8260 181.7932 211.8090 222.8897 248.2670 255.0173 261.1101 271.6834 286.0966 298.1264 303.3647 328.8529 355.6117 367.0008 424.8292 446.8855 498.2607 518.7261 544.3592 584.6802 590.2946 626.4669 662.2913 686.8743 713.5000 719.3478 761.5912 780.6004 794.3046 837.0227 849.5633 862.6815 862.9440 874.7955 880.1362 892.9433 925.6837 934.0323 947.6969 978.7262 984.3871 986.3692 991.6416 1008.1850 1029.9738 1049.8343 1057.2383 1073.8487 1120.6074 1122.9961 1137.3495 1157.7287 1174.2178 1181.0867 1187.2869 1204.9726 1215.0235 1238.4030 1242.1418 1256.1573 1282.6683 1296.5131 1302.7769 1329.6578 1337.7182 1342.0105 1372.9996 1380.6137 1385.4241 1393.8656 1453.1064 1459.7504 1463.4893 1466.3200 1471.2461 1475.9558 1476.7650 1480.2043 1486.1690 1493.6270 1577.2699 1597.4880 1626.7221 2956.9963 2962.2787 2965.7351 2976.1565 2983.6812 2987.9937 2992.0960 3023.9849 3027.1710 3044.5830 3069.6427 3075.9439 3079.2647 3086.2814 3095.0088 3104.5204 3182.6000 3230.5495 3245.9604 3270.2339
redmass: 4.2693 4.2043 5.0635 3.2242 4.1740 3.3895 1.0596 2.4895 2.0824 1.7469 2.4533 1.8720 1.9676 2.4160 2.7996 3.5831 2.4722 2.7347 2.0924 3.0368 3.2085 2.8871 3.9052 3.5726 3.8982 3.9738 2.6283 2.3818 3.6925 1.9199 2.0565 1.6854 2.3493 3.3432 2.1127 5.7541 2.2570 1.5192 1.9573 2.0138 2.2834 1.8716 1.5760 1.9680 1.5614 2.1434 2.1888 2.8177 1.8771 1.8237 2.5015 1.7316 1.7787 1.6978 1.9675 1.8286 1.9912 2.2078 1.8506 2.2830 1.4126 2.1058 2.1074 1.6098 1.6299 1.5599 2.4050 2.1373 1.3951 1.5448 1.4259 1.2040 3.2333 1.2618 1.2010 1.0734 1.0721 1.0539 1.0730 1.0730 1.0794 3.4993 1.1017 1.0675 1.0603 6.2990 7.9873 11.4719 1.0790 1.0632 1.0603 1.0355 1.0369 1.0603 1.0384 1.1009 1.0964 1.1028 1.0998 1.0991 1.1001 1.0998 1.0993 1.0966 1.0966 1.0925 1.0989 1.1084
irintensity: 0.9400 0.0746 0.5646 1.2374 1.9903 0.7782 0.2572 1.5826 1.6143 1.0395 0.3078 0.0341 0.0429 0.1366 0.0154 0.8286 1.5606 0.6876 0.7436 0.4088 1.1443 1.4617 1.5425 1.9232 19.3440 7.0064 0.1853 11.1311 7.0676 1.3558 23.5724 64.9273 4.5414 17.8080 7.4708 26.2297 1.4717 1.5280 0.6034 13.9090 13.0444 4.6281 5.5349 1.2294 15.3375 18.2673 13.7470 6.4603 11.7488 3.8297 5.9336 0.4458 0.1979 4.7746 0.7165 43.6069 29.2757 9.5872 0.3873 6.5806 4.3257 7.0571 23.5431 9.6495 8.9688 11.5291 0.3915 12.7033 0.6387 0.7602 0.0755 10.3130 7.3916 22.3431 14.8863 0.4543 1.3356 2.0362 14.3459 4.9776 9.7072 13.5751 18.5049 16.0692 8.6793 0.8007 70.6190 271.9862 10.8651 28.7075 32.7732 31.9625 28.0129 21.4627 26.4071 30.0492 46.8181 55.9371 6.4951 57.2783 34.5317 19.8414 33.9282 30.7686 5.9484 0.3534 0.3909 0.3727
temp: 298.150 k
press: 1.00000 atm
elementType: 8 8 6 6 6 6 6 6 6 6 6 6 6 6 6 6 6 6 1 1 1 1 1 1 1 1 1 1 1 1 1 1 1 1 1 1 1 1
symmnumber: 1
zpe: 837764.5 jmol-1
zpe.correction: 0.319088 hartree
zpe.thermalcorrener: 0.336014 hartree
zpe.thermalcorrenthalpy: 0.336958 hartree
zpe.thermalcorrgfe: 0.275299 hartree
zpe.sumelectzpe: -770.769908 hartree
zpe.sumelectthermal: -770.752982 hartree
zpe.sumelectthermalent: -770.752038 hartree
zpe.sumelectthermalfe: -770.813696 hartree
dipole: 4.2475 -3.0438 0.7382
dipole: 5.2774
quadrupole: -108.0079 -117.1712 -104.9831
quadrupole: 2.6845 -4.2703 5.1361
quadrupole: 2.0462 -7.1171 5.0709 2.6845 -4.2703 5.1361
hfenergy: -771.0889953 hartree
pointgroup: C01 [X(C16H20O2)]
dipole: -1.6695055 1.2153095 0.2161921 debye
polarizability: 210.0674792|-5.1899879|164.7540942|3.5794615|-7.4078509|129.9919977 unknown
InChI: InChI=1S/C16H20O2/c1-15(2)6-4-7-16(3)13(15)9-12(17)14(16)11-5-8-18-10-11/h5,8-10,14H,4,6-7H2,1-3H3
charge 0 multiplicity 1
38 atoms
O  1.186871 -2.812186 -0.309695
O  4.245533 1.146231 -0.152598
C  -0.360275 0.505889 0.027684
C  -2.978462 -0.11069 0.191858
C  -1.513379 -0.525903 0.052612
C  -0.745887 1.732291 -0.847386
C  0.829112 -0.33947 -0.59562
C  -3.221777 1.168379 -0.681791
C  -2.154187 2.271298 -0.504164
C  0.01363 0.962841 1.469132
C  -1.038913 -1.804165 -0.090208
C  0.421562 -1.80912 -0.309894
C  -3.332774 0.186059 1.685061
C  -3.925837 -1.236837 -0.30096
C  2.237466 0.035957 -0.218936
C  3.080068 -0.573829 0.798359
C  2.983464 1.066828 -0.769059
C  4.275155 0.117712 0.810603
H  -0.739181 1.432455 -1.916197
H  0.01789 2.525779 -0.729027
H  0.725778 -0.236829 -1.697792
H  -4.229198 1.563489 -0.443964
H  -3.241051 0.864538 -1.748939
H  -2.175491 2.668072 0.529257
H  -2.395265 3.124395 -1.167046
H  0.929095 1.579034 1.434238
H  -0.784782 1.566751 1.930147
H  0.210049 0.095723 2.124485
H  -1.621056 -2.727523 -0.060697
H  -2.80824 1.070752 2.080727
H  -4.420084 0.37109 1.769397
H  -3.079983 -0.67668 2.327433
H  -4.971521 -0.877093 -0.290267
H  -3.67917 -1.547962 -1.332232
H  -3.872325 -2.127917 0.350816
H  2.826648 -1.442801 1.401401
H  2.805134 1.791334 -1.559208
H  5.199983 0.031313 1.373172
