program: Gaussian 09
title: 000180222
version: EM64L-G09RevD.01
frameworkgroup: C1[X(C13H16O3)]
method: RPBEPBE
basis: SDD
operation: Freq
keyword: #pfreq=noraman
keyword: PBEPBE/SDD
title: #p freq=noraman PBEPBE/SDD
converged: YES YES NO NO
title: Mulliken charges:
elementType: O O O C C C C C C C C C C C C C H H H H H H H H H H H H H H H H
charge: -0.187016 -0.202143 -0.199012 -0.195629 -0.458174 -0.397442 -0.405193 -0.385326 0.146734 -0.517092 0.419886 0.240838 -0.367575 -0.364301 -0.798031 -0.193720 0.287334 0.214495 0.240506 0.231284 0.218370 0.201483 0.213328 0.214516 0.249754 0.217306 0.291681 0.271964 0.250626 0.261311 0.236961 0.262280
chargesum: 0.00000
title: Mulliken charges with hydrogens summed into heavy atoms:
elementType: O O O C C C C C C C C C C C C C
charge: -0.187016 -0.202143 -0.199012 0.091705 -0.003174 -0.166158 0.014661 0.042519 0.146734 -0.050032 0.419886 0.240838 -0.075895 -0.092338 -0.049133 0.068560
polarizability: 1.57658466e+02 1.02827670e+01 1.35401390e+02 8.34696325e+00 -9.16196521e+00 1.21290925e+02
1716.lowfreq: 0.0001 0.0005 0.0007 5.5720 9.1819 12.1103 32.2128 38.0208 57.8913
frequency: 31.3023 38.0029 57.7656 63.0333 88.0865 113.5178 126.0832 140.6537 169.0815 195.7408 245.6615 307.0717 317.5600 342.5408 356.4011 409.0016 440.4156 491.1874 538.0179 564.8369 586.8574 588.4511 652.4290 666.6430 720.6958 729.7868 758.7552 773.1907 799.8702 837.2710 848.3040 856.5795 878.3127 888.1618 918.8445 930.7309 959.1420 969.7009 978.7122 984.7694 1027.1028 1044.0133 1046.8357 1074.4451 1101.8084 1119.1090 1128.8378 1132.5745 1160.5857 1200.5161 1218.6915 1240.2280 1244.2955 1248.8413 1259.2913 1285.1594 1300.8805 1302.8490 1316.8016 1338.9575 1344.2574 1354.7169 1366.7890 1389.1117 1438.7921 1450.8006 1452.0682 1462.6254 1472.7039 1476.7698 1477.3932 1572.6091 1619.5925 1640.6045 2960.4515 2974.1058 2975.3936 2980.6756 2984.3120 3015.0430 3031.9251 3038.2351 3045.4363 3051.4852 3057.8424 3070.0973 3123.3709 3232.1651 3247.8700 3270.9686
redmass: 5.1958 3.7288 5.0873 4.5282 4.2571 4.5144 2.3644 1.2677 4.3117 4.3504 2.5045 3.9972 5.6186 2.1008 3.8409 3.2593 2.9792 2.7899 3.1421 3.0955 3.6941 3.1575 3.0577 2.6533 1.5202 2.6251 2.4640 1.6513 1.7730 2.8549 5.9788 2.8116 1.4308 2.0681 1.9282 2.2856 1.9306 3.5952 2.3976 2.8357 1.9413 1.7905 2.4591 1.7326 1.5462 2.5348 1.4464 1.9639 2.0528 1.2912 1.5270 1.6719 1.4752 1.5540 1.5429 1.5212 1.5989 1.3781 1.3057 1.4163 1.5039 1.4161 1.2503 2.6376 1.0716 1.0862 1.0540 1.0822 1.0816 4.2237 1.1110 6.0436 9.1940 7.8749 1.0665 1.0657 1.0378 1.0625 1.0614 1.0834 1.0863 1.0954 1.0991 1.1011 1.0958 1.0952 1.0997 1.0926 1.0990 1.1085
irintensity: 1.2553 6.5910 2.3830 0.1495 0.0857 2.5201 1.6834 0.0716 3.7953 1.1828 0.8023 2.0916 0.3406 1.3872 3.5843 1.8427 4.9250 5.0251 6.3551 4.6520 10.6958 8.2637 11.6516 17.5620 2.7654 7.8423 19.8541 58.3891 20.8324 0.5993 26.4765 2.5556 5.9640 5.7241 3.2491 21.6822 15.0787 3.0372 21.6026 6.0990 0.8256 3.9811 7.4146 19.8081 8.9458 18.2502 2.9689 29.7605 49.8935 6.9108 18.3649 3.7457 3.1383 18.3187 23.4441 45.6539 14.2071 15.0767 1.4519 1.8675 2.1415 2.5677 65.1338 6.8997 14.3874 15.4880 22.4109 9.7877 14.8166 9.1050 9.6785 0.3179 145.0511 101.0148 14.7948 18.8643 1.7408 31.4732 36.7162 8.3491 24.6581 42.3856 37.7749 37.5938 9.4885 27.4599 13.2066 1.8134 0.3601 0.2802
temp: 298.150 k
press: 1.00000 atm
elementType: 8 8 8 6 6 6 6 6 6 6 6 6 6 6 6 6 1 1 1 1 1 1 1 1 1 1 1 1 1 1 1 1
symmnumber: 1
zpe: 686257.0 jmol-1
zpe.correction: 0.261381 hartree
zpe.thermalcorrener: 0.276864 hartree
zpe.thermalcorrenthalpy: 0.277809 hartree
zpe.thermalcorrgfe: 0.217143 hartree
zpe.sumelectzpe: -729.418008 hartree
zpe.sumelectthermal: -729.402525 hartree
zpe.sumelectthermalent: -729.401581 hartree
zpe.sumelectthermalfe: -729.462246 hartree
dipole: 0.3490 -3.2524 3.0916
dipole: 4.5009
quadrupole: -99.6645 -101.2477 -91.3889
quadrupole: -6.9663 8.4451 8.4293
quadrupole: -2.2308 -3.8140 6.0448 -6.9663 8.4451 8.4293
hfenergy: -729.6793894 hartree
pointgroup: C01 [X(C13H16O3)]
dipole: -0.1278856 1.2800446 1.2168814 debye
polarizability: 157.764089|10.1585654|135.2694223|-8.3319889|9.2052404|121.3172697 unknown
InChI: InChI=1S/C13H16O3/c1-9(14)13(10-6-7-16-8-10)11-4-2-3-5-12(11)15/h6-8,11,13H,2-5H2,1H3
charge 0 multiplicity 1
32 atoms
O  -2.843576 -1.320915 -0.964396
O  3.434843 1.354984 0.632662
O  0.634369 -2.523587 -0.763612
C  -0.869016 0.108903 -0.726712
C  -0.828155 1.653036 -0.908053
C  0.132279 -0.422052 0.381908
C  -1.473687 2.423707 0.265823
C  -2.936777 1.976139 0.480463
C  -2.298111 -0.345613 -0.380112
C  -3.024344 0.441959 0.712666
C  1.522523 0.156627 0.229877
C  0.198712 -1.973771 0.279359
C  2.455778 -0.069959 -0.864652
C  2.154315 1.022272 1.10912
C  -0.282716 -2.768475 1.479039
C  3.590984 0.665258 -0.58713
H  -0.582334 -0.389935 -1.671481
H  -1.3745 1.901624 -1.840528
H  0.218834 1.973584 -1.057361
H  -0.253117 -0.150203 1.381765
H  -1.437854 3.509997 0.058514
H  -0.891742 2.262975 1.196207
H  -3.536397 2.241806 -0.412717
H  -3.388786 2.504681 1.340817
H  -4.06954 0.090748 0.758824
H  -2.550564 0.206845 1.689831
H  2.289923 -0.725349 -1.716759
H  1.873648 1.477014 2.055258
H  -1.360683 -2.574957 1.646163
H  -0.133154 -3.846188 1.312701
H  0.251926 -2.45123 2.394517
H  4.54422 0.811074 -1.086505
