program: Gaussian 09
title: 000180221
version: EM64L-G09RevD.01
frameworkgroup: C1[X(C13H17NO4)]
method: RPBEPBE
basis: SDD
operation: Freq
keyword: #p
keyword: freq=noraman
keyword: PBEPBE/SDD
title: #p freq=noraman PBEPBE/SDD
converged: YES YES NO NO
title: Mulliken charges:
elementType: O O O O N C C C C C C C C C C C C C H H H H H H H H H H H H H H H H H
charge: -0.197890 -0.206335 -0.226688 -0.182060 0.114621 -0.232395 -0.283560 -0.440344 -0.414291 -0.103833 0.128441 -0.388667 -0.512240 0.407797 -0.725792 -0.422353 -0.342785 -0.170538 0.265524 0.294054 0.236960 0.210873 0.206557 0.219764 0.284637 0.220414 0.212473 0.234353 0.248329 0.247012 0.243399 0.251767 0.278894 0.278869 0.265035
chargesum: 0.00000
title: Mulliken charges with hydrogens summed into heavy atoms:
elementType: O O O O N C C C C C C C C C C C C C
charge: -0.197890 -0.206335 -0.226688 -0.182060 0.114621 0.033129 0.010494 0.007489 0.012030 0.180804 0.128441 0.044220 -0.029558 0.407797 0.016386 -0.143458 -0.063916 0.094496
polarizability: 1.66138580e+02 8.46285181e+00 1.38936909e+02 -5.25926816e-01 4.73193856e+00 1.42442812e+02
1716.lowfreq: -10.2236 -2.0664 -0.0011 -0.0011 -0.0007 11.9654 38.1287 46.8781 49.4497
frequency: 38.0459 46.8172 48.3818 54.9354 74.8756 87.8364 110.9923 111.3835 159.7861 193.2678 207.1038 237.7357 254.2819 286.0009 305.9499 340.6653 357.3373 418.0585 441.0686 458.9476 498.7853 500.5457 570.9599 590.5182 610.6931 647.6785 656.4948 684.2190 727.5662 744.2996 758.2983 786.1838 790.0244 813.4516 842.5423 850.3086 861.1781 870.3681 894.0558 923.1002 962.8443 973.3493 984.5454 992.5678 1032.1877 1044.5255 1053.7532 1067.3018 1085.5698 1104.8517 1114.7760 1126.8584 1140.0341 1150.3277 1204.0205 1212.4384 1226.1832 1238.6235 1242.3317 1252.1296 1263.1273 1265.1470 1288.0331 1290.3584 1301.7652 1333.6123 1334.3939 1339.1833 1346.2902 1352.5805 1391.6216 1400.1631 1420.1475 1450.6063 1462.0688 1470.9123 1472.4462 1473.6654 1476.3998 1476.8239 1574.5448 1618.4258 2967.1570 2982.0824 2984.0822 2985.8394 3006.0208 3012.4106 3020.9608 3030.7227 3041.1047 3048.1073 3055.4896 3073.6550 3103.4553 3115.7699 3217.5634 3252.0787 3272.1552
redmass: 5.7264 10.8563 5.0689 4.4832 4.7770 6.0948 4.5011 3.9219 3.7292 4.0895 1.1175 3.2014 3.5784 3.7077 3.4920 1.9506 4.7199 3.5403 3.1910 4.9482 4.6203 2.9180 2.8272 3.8902 4.1777 3.4150 4.4455 3.0629 1.3434 2.2517 2.7436 2.0623 3.2761 1.8600 2.5581 4.3502 2.6773 1.4805 2.1983 1.7622 3.0909 2.9547 2.1987 2.6530 1.9335 2.0611 1.9613 1.7149 1.5461 1.6045 2.6913 1.6128 2.2121 2.1053 1.4940 3.0970 1.4227 1.9604 1.4056 1.3017 1.5732 1.5675 1.4507 1.3438 1.3537 1.3896 1.6575 1.4674 1.4860 1.4281 1.5148 2.0672 3.7676 1.0966 1.0823 1.0506 1.0783 1.0936 1.1840 3.0260 5.5358 8.9607 1.0656 1.0667 1.0601 1.0622 1.0375 1.0813 1.0837 1.0847 1.0960 1.0998 1.1021 1.0962 1.0994 1.1006 1.0943 1.0986 1.1072
irintensity: 2.2312 0.1643 2.8562 0.4692 3.9862 0.2757 2.1340 1.3098 1.3934 0.7686 0.0720 1.0216 2.1346 1.5186 0.8793 0.9969 4.6627 0.7984 2.1046 7.3498 3.1321 5.4589 3.1874 12.5264 5.7568 10.3197 3.1938 7.0187 9.2859 27.3724 2.8384 73.0508 9.4187 24.3101 5.1642 23.9059 3.5766 2.2214 4.2087 14.0056 5.4389 5.9647 8.4975 22.7649 1.9836 3.1095 15.7577 13.1999 8.3859 7.9017 13.1457 12.0519 20.5754 0.9795 2.0802 51.1518 10.7087 13.0858 0.8000 5.0693 4.8930 24.3188 20.8608 6.6781 21.7587 3.3651 6.0352 4.6168 0.1410 1.2682 81.1908 18.2933 61.1828 16.9499 7.4198 7.8712 22.5543 9.4942 9.6355 9.3716 0.2320 146.0811 9.2920 17.6668 29.1335 34.8439 4.6279 8.0446 3.9610 35.8301 37.8249 27.8642 43.2943 25.7212 7.0857 11.0313 0.5869 0.7998 0.0269
temp: 298.150 k
press: 1.00000 atm
elementType: 8 8 8 8 7 6 6 6 6 6 6 6 6 6 6 6 6 6 1 1 1 1 1 1 1 1 1 1 1 1 1 1 1 1 1
symmnumber: 1
zpe: 741893.7 jmol-1
zpe.correction: 0.282572 hartree
zpe.thermalcorrener: 0.299770 hartree
zpe.thermalcorrenthalpy: 0.300714 hartree
zpe.thermalcorrgfe: 0.236330 hartree
zpe.sumelectzpe: -859.755501 hartree
zpe.sumelectthermal: -859.738303 hartree
zpe.sumelectthermalent: -859.737359 hartree
zpe.sumelectthermalfe: -859.801743 hartree
dipole: 2.3386 -3.1965 -0.5486
dipole: 3.9984
quadrupole: -111.5806 -111.7937 -110.0123
quadrupole: 1.0081 -7.0163 3.1786
quadrupole: -0.4517 -0.6649 1.1166 1.0081 -7.0163 3.1786
hfenergy: -860.0380732 hartree
pointgroup: C01 [X(C13H17N1O4)]
dipole: 0.884729 -1.2683766 -0.2883604 debye
polarizability: 166.6118486|7.6203981|137.8890821|0.2666532|4.5201855|143.0173707 unknown
InChI: InChI=1S/C13H17NO4/c1-9(14(16)17)13(10-6-7-18-8-10)11-4-2-3-5-12(11)15/h6-9,11,13H,2-5H2,1H3
charge 0 multiplicity 1
35 atoms
O  2.667514 1.137545 1.77449
O  -2.916109 -2.230693 0.704726
O  -0.977853 2.10925 -1.889391
O  -2.495018 2.553268 -0.251874
N  -1.360724 2.118128 -0.655608
C  1.173227 -0.503926 0.750757
C  -0.033154 0.069601 -0.074662
C  1.647938 -1.889799 0.211671
C  2.383488 -1.793396 -1.144917
C  -0.352863 1.543832 0.374393
C  2.361662 0.473163 0.745593
C  3.590623 -0.832462 -1.057661
C  3.154974 0.574185 -0.553555
C  -1.255985 -0.823005 -0.013232
C  -0.859084 1.725267 1.803502
C  -2.18957 -1.049996 -1.106132
C  -1.737805 -1.555035 1.063177
C  -3.173473 -1.89905 -0.638325
H  0.85766 -0.61373 1.805513
H  0.272491 0.14962 -1.134237
H  0.777533 -2.566477 0.135964
H  2.335545 -2.332459 0.960126
H  1.688263 -1.450018 -1.936722
H  2.726096 -2.800998 -1.447321
H  0.55033 2.159347 0.201722
H  4.083285 -0.730549 -2.042413
H  4.34421 -1.248301 -0.359844
H  2.512115 1.042545 -1.328966
H  4.020842 1.238014 -0.389062
H  -0.044908 1.466835 2.502439
H  -1.145284 2.773804 1.985953
H  -1.737143 1.091089 2.00477
H  -2.126139 -0.619061 -2.104282
H  -1.402013 -1.721876 2.082715
H  -4.066369 -2.341758 -1.069012
