program: Gaussian 09
title: 000180236
version: EM64L-G09RevD.01
frameworkgroup: C1[X(C21H17NO4)]
method: RPBEPBE
basis: SDD
operation: Freq
keyword: #p
keyword: freq=noraman
keyword: PBEPBE/SDD
title: #p freq=noraman PBEPBE/SDD
converged: NO YES NO NO
title: Mulliken charges:
elementType: O O O O N C C C C C C C C C C C C C C C C C C C C C H H H H H H H H H H H H H H H H H
charge: -0.454504 -0.454056 -0.480990 -0.437542 -0.028098 -0.112793 -0.230377 -0.335040 -0.305197 0.310762 0.274544 -0.289664 0.481938 -0.474192 -0.452405 -0.480262 -0.218696 0.468117 0.247521 -0.448740 0.421968 -0.473062 -0.386913 -0.429626 -0.238847 -0.238554 0.261583 0.275824 0.295878 0.251766 0.250059 0.242635 0.257362 0.363912 0.358597 0.367858 0.370820 0.237223 0.240273 0.279937 0.242509 0.235702 0.232767
chargesum: 0.00000
title: Mulliken charges with hydrogens summed into heavy atoms:
elementType: O O O O N C C C C C C C C C C C C C C C C C C C C C
charge: -0.090592 -0.095459 -0.113131 -0.066722 -0.028098 0.148790 0.045448 -0.039162 -0.053431 0.310762 0.274544 -0.289664 0.481938 -0.224133 -0.209770 -0.222899 -0.218696 0.468117 0.247521 -0.211517 0.421968 -0.232789 -0.106976 -0.187117 -0.003145 -0.005787
polarizability: 4.28259299e+02 -4.09738609e+01 2.81698845e+02 -9.14173693e+00 -1.13902959e+01 1.28123980e+02
1716.lowfreq: -0.0004 -0.0004 0.0006 1.7215 7.3004 11.9956 35.5829 41.7466 71.9925
frequency: 35.3060 41.6458 71.9740 85.2108 86.9824 109.8008 162.3569 176.8636 186.2979 201.9859 222.4528 243.8022 267.1115 281.7274 308.1965 317.0156 329.2014 354.7809 367.0098 372.4057 391.1827 409.9108 421.7122 435.4992 438.7591 475.2952 490.4832 505.5150 521.6873 529.0374 555.7314 566.6288 580.6457 597.0732 618.5743 644.4016 648.7712 659.0329 695.9270 710.2433 719.3461 729.9588 744.4755 761.6654 766.3548 788.7418 811.9604 820.3642 831.8243 840.2414 843.7282 869.6567 900.9893 903.4439 931.6958 932.7481 961.7642 971.4936 974.7705 980.0928 988.0756 990.3789 1003.3349 1006.1883 1020.0406 1035.4830 1082.6732 1090.9887 1101.6331 1145.7609 1160.7966 1171.3423 1177.8305 1186.8903 1193.8544 1205.4281 1221.8277 1227.2747 1233.5548 1250.2550 1266.8745 1271.1998 1286.5083 1305.9397 1310.4248 1334.6314 1337.2660 1346.4651 1351.4307 1363.6490 1385.4578 1392.8721 1406.0459 1414.4966 1419.1335 1434.2853 1446.6316 1451.9266 1476.8354 1492.0774 1537.0490 1558.8279 1585.9678 1603.8099 1617.9793 1630.3357 3040.4016 3058.1051 3087.3713 3098.0413 3120.9378 3123.0969 3124.8255 3126.4010 3140.8013 3146.3792 3149.3292 3158.7042 3173.5321 3230.8903 3396.8771 3506.8582 3571.5118
redmass: 6.1126 5.5256 6.4360 5.2678 6.3006 5.5890 5.2612 4.8280 5.9551 7.6262 5.8925 5.4843 5.8741 5.4591 4.6534 6.7157 4.1943 1.2973 1.3579 2.7214 5.1738 3.6692 3.9164 4.3876 4.7906 4.7856 4.7916 6.5096 4.5300 3.7925 5.4211 3.8264 4.6769 5.5915 1.1836 4.7473 6.3893 4.3975 5.7191 5.3926 3.0100 1.3289 3.8853 5.9701 1.2608 3.1619 5.1276 1.5648 2.3336 2.1301 3.3279 4.9008 1.6876 6.6007 1.6684 3.5849 3.6474 1.3909 1.6041 3.9147 1.4150 5.0300 3.2178 1.3533 4.2110 2.0995 2.3392 2.5709 2.1410 1.3854 1.0956 1.1618 1.4165 1.3480 1.3340 1.6207 1.8187 2.0826 1.9379 1.3016 1.8967 2.0401 1.3035 2.5073 1.3160 2.2687 2.6635 1.6487 1.2685 1.3412 3.6786 1.3422 4.5998 2.1059 5.3893 4.6498 1.1651 3.2828 3.1183 3.9397 6.9031 7.3749 5.9742 6.9566 6.6483 7.1056 1.0855 1.0866 1.0862 1.0888 1.0872 1.0903 1.0882 1.0868 1.0902 1.0982 1.0972 1.0953 1.0981 1.0688 1.0645 1.0649 1.0663
irintensity: 0.0125 0.1935 3.4177 1.9442 0.5379 2.8339 6.4586 0.1653 1.4589 4.7055 2.0313 1.6085 2.4525 0.4178 11.3666 13.5642 13.3954 41.7857 51.5232 47.7805 7.6071 7.0533 0.9486 11.8388 1.4352 3.9594 3.4697 1.2813 0.6588 1.3381 2.2069 6.0050 12.0202 1.9502 105.5700 7.7230 9.8012 5.0567 4.3589 16.8790 30.9809 134.5108 13.1188 2.5961 38.5602 77.9615 1.0652 69.2358 0.3859 4.3834 4.6563 10.7701 2.4732 52.6171 22.8515 63.3569 9.0144 2.9325 1.8494 77.6202 0.0426 21.3220 20.9188 0.1870 50.6111 9.9731 43.0435 7.8700 5.8699 4.4270 29.3706 2.0562 24.5761 41.4713 7.7873 21.1790 27.5631 9.6327 9.6964 19.7817 2.2214 5.4107 19.0892 14.5513 9.4158 4.4892 0.6006 31.1780 29.2214 4.6634 16.5988 43.1851 24.6853 3.4198 24.8339 8.7546 128.0051 6.2738 19.4244 16.1839 18.7363 2.0207 8.7017 11.5858 1.6352 2.1210 12.4809 38.3248 4.2264 32.9751 0.0370 3.4408 9.4169 2.6345 8.9443 35.6195 24.6928 26.9862 21.5036 110.5354 48.2161 14.5030 10.9647
temp: 298.150 k
press: 1.00000 atm
elementType: 8 8 8 8 7 6 6 6 6 6 6 6 6 6 6 6 6 6 6 6 6 6 6 6 6 6 1 1 1 1 1 1 1 1 1 1 1 1 1 1 1 1 1
symmnumber: 1
zpe: 873150.4 jmol-1
zpe.correction: 0.332565 hartree
zpe.thermalcorrener: 0.352714 hartree
zpe.thermalcorrenthalpy: 0.353658 hartree
zpe.thermalcorrgfe: 0.284879 hartree
zpe.sumelectzpe: -1164.285594 hartree
zpe.sumelectthermal: -1164.265446 hartree
zpe.sumelectthermalent: -1164.264502 hartree
zpe.sumelectthermalfe: -1164.333281 hartree
dipole: 5.4163 4.3434 -0.0689
dipole: 6.9431
quadrupole: -146.8093 -138.0572 -159.5520
quadrupole: -8.2760 3.9127 -7.3559
quadrupole: 1.3302 10.0823 -11.4125 -8.2760 3.9127 -7.3559
hfenergy: -1164.6181596 hartree
pointgroup: C01 [X(C21H17N1O4)]
dipole: 2.1102977 1.7205295 -0.2196348 debye
polarizability: 428.9647203|-40.3836664|277.1524463|-8.4437015|-25.6624479|131.964957 unknown
InChI: InChI=1S/C21H17NO4/c23-18-14-8-7-12-9-11-6-5-10-3-1-2-4-13(10)16(11)22-17(12)15(14)19(24)21(26)20(18)25/h1-9,18-21,23-26H
charge 0 multiplicity 1
43 atoms
O  -2.97879 -2.877461 -1.252925
O  -4.359664 -0.717983 -1.886434
O  -2.241919 -1.548626 2.022279
O  -4.583084 -0.095315 1.845279
N  0.528221 -0.21153 0.109352
C  -3.331329 -2.08794 -0.076585
C  -4.459508 -1.06484 -0.441687
C  -2.060537 -1.425551 0.527448
C  -4.371102 0.216103 0.425011
C  -1.881411 0.043954 0.195189
C  -3.01693 0.874587 0.172498
C  -0.569048 0.612663 0.013523
C  -0.449504 2.041271 -0.246026
C  -2.887473 2.279683 -0.075122
C  -1.634275 2.850468 -0.286685
C  0.85656 2.567798 -0.426392
C  1.77133 0.3139 -0.063331
C  1.986633 1.729477 -0.343304
C  2.932398 -0.576495 0.039011
C  3.336049 2.227592 -0.512782
C  4.253215 -0.032535 -0.131404
C  4.420809 1.382478 -0.408942
C  2.779903 -1.967497 0.300301
C  5.381379 -0.899482 -0.027305
C  3.903144 -2.803396 0.398053
C  5.211981 -2.267123 0.235386
H  -3.707136 -2.790279 0.688067
H  -5.450466 -1.531635 -0.341102
H  -1.177021 -2.008082 0.225431
H  -5.196734 0.897893 0.160509
H  -3.790307 2.900467 -0.087763
H  -1.537436 3.925518 -0.479034
H  0.98712 3.638735 -0.625162
H  -3.342482 -2.376573 -2.039083
H  -3.661514 -0.017369 -1.992765
H  -1.40237 -1.264223 2.464565
H  -3.785027 -0.617532 2.175732
H  3.476639 3.294255 -0.723479
H  5.43856 1.769467 -0.536827
H  1.766607 -2.362047 0.41655
H  6.386717 -0.481815 -0.157153
H  3.773941 -3.872439 0.597637
H  6.084761 -2.92444 0.313067
