program: Gaussian 09
title: 000180201
version: EM64L-G09RevD.01
frameworkgroup: C1[X(C13H20N2O)]
method: RPBEPBE
basis: SDD
operation: Freq
keyword: #p
keyword: freq=noraman
keyword: PBEPBE/SDD
title: #p freq=noraman PBEPBE/SDD
converged: YES YES NO NO
title: Mulliken charges:
elementType: O N N C C C C C C C C C C C C C H H H H H H H H H H H H H H H H H H H H
charge: -0.273840 -0.425247 -0.606772 -0.032514 -0.460835 -0.367759 -0.709168 -0.709520 0.446829 0.402250 -0.370984 -0.430410 -0.395369 -0.364253 -0.639210 0.198997 0.203773 0.209036 0.209416 0.227018 0.225664 0.211294 0.215857 0.214826 0.214459 0.216163 0.210638 0.294673 0.240603 0.214926 0.232364 0.234205 0.246262 0.245452 0.347230 0.323946
chargesum: 0.00000
title: Mulliken charges with hydrogens summed into heavy atoms:
elementType: O N N C C C C C C C C C C C C C
charge: -0.273840 -0.130574 0.064404 0.171259 -0.042383 0.084923 -0.067191 -0.068260 0.446829 0.402250 -0.130381 -0.215484 -0.163006 -0.130048 -0.147496 0.198997
polarizability: 2.40107036e+02 2.05775608e+00 1.32701875e+02 -1.01319796e+01 -1.01961008e+01 1.20000131e+02
1716.lowfreq: -13.8937 -3.0910 -0.0007 -0.0006 -0.0005 4.0725 14.0747 24.7349 28.8831
frequency: 10.9862 24.4354 28.8591 37.4980 63.7428 69.3446 106.9603 124.6050 182.7061 194.3171 215.0704 227.1690 248.7659 308.5480 310.2135 340.4186 352.6503 357.4627 384.1024 411.3402 442.4456 497.2302 501.1609 533.0543 559.7318 562.9666 592.0411 636.7905 660.4797 716.7558 775.8860 780.5866 798.8746 818.0045 826.0290 844.6413 847.2856 913.1337 918.0152 940.9349 953.2507 956.1361 967.5793 997.9222 999.0050 1003.2109 1058.7098 1095.6352 1117.4260 1148.4949 1153.7376 1180.0888 1191.9119 1193.8143 1216.7854 1225.5818 1266.1762 1277.9375 1289.3739 1303.6645 1322.7695 1334.5223 1338.2888 1346.6152 1367.8716 1381.2596 1383.7255 1399.7722 1422.7700 1448.2867 1462.9647 1464.6268 1474.0813 1476.2379 1484.3747 1490.0118 1504.4992 1527.9000 1571.6181 1577.2091 1633.9964 1641.5459 2937.3759 2953.2399 2970.0116 2971.6442 2975.6113 2976.2055 3003.3781 3019.1000 3056.8010 3064.0053 3069.5630 3071.3906 3073.9732 3106.7828 3117.3318 3132.4179 3157.4959 3508.0136 3565.5862 3666.0870
redmass: 3.1740 3.8341 6.5402 3.6686 4.1271 3.6281 2.2001 2.7286 4.0188 3.3288 1.1917 1.2348 2.4577 1.8085 1.3149 4.2194 3.0927 2.2135 2.9481 2.9806 3.4250 1.7979 2.8664 2.7491 2.3986 1.2196 4.3027 5.6109 1.5235 3.5623 3.3077 1.2421 2.6360 1.2602 2.8370 2.6871 4.3959 1.1831 2.0980 1.3638 1.3236 1.3515 2.0749 2.6570 1.6939 2.0105 1.8511 2.6404 1.4839 2.3430 1.8712 1.1308 1.1715 1.7576 1.9559 1.1590 1.4730 1.9832 1.1027 1.7255 1.4608 1.4459 2.9238 1.4160 2.8402 1.2210 1.6802 1.2244 3.5932 1.1129 1.1019 1.0451 1.6508 1.0578 1.0638 1.0544 1.1185 3.0431 1.3794 4.8514 6.4390 4.5415 1.0571 1.0636 1.0536 1.0710 1.0821 1.0440 1.0608 1.1038 1.0998 1.1000 1.0998 1.0989 1.0989 1.0867 1.0891 1.0964 1.0940 1.0444 1.0769 1.1043
irintensity: 0.1477 0.2660 8.4568 1.5950 0.0990 0.1121 0.0631 11.9526 0.1161 0.7641 0.1451 0.4464 1.1699 18.8668 55.3430 22.4435 0.8787 4.6424 0.7380 0.0572 1.8692 12.5905 6.9585 31.9101 11.5452 159.1550 12.9190 2.5703 55.9888 0.0495 5.8071 8.6882 21.2517 1.1526 15.1596 27.1123 0.7571 2.5552 2.8048 0.5330 0.1198 0.2621 2.6726 0.9998 0.0056 6.5037 8.4377 5.0996 13.2886 4.8039 2.8801 1.7435 13.6409 13.0921 2.4225 0.9342 8.2662 38.1530 0.2035 49.2759 38.4705 2.1993 97.9112 4.5404 58.9509 22.5305 13.5352 15.5463 6.4252 7.3088 23.9371 1.7631 9.2451 3.2444 33.4637 21.2681 66.9539 261.9571 156.8795 6.4870 10.9792 514.6070 41.6939 34.2342 9.8087 60.8420 44.7050 8.8252 22.5961 64.2089 5.1650 15.2893 16.8495 69.0121 108.2113 16.9116 20.4285 23.3785 16.4315 29.4478 37.9357 58.8956
temp: 298.150 k
press: 1.00000 atm
elementType: 8 7 7 6 6 6 6 6 6 6 6 6 6 6 6 6 1 1 1 1 1 1 1 1 1 1 1 1 1 1 1 1 1 1 1 1
symmnumber: 1
zpe: 808751.2 jmol-1
zpe.correction: 0.308037 hartree
zpe.thermalcorrener: 0.325787 hartree
zpe.thermalcorrenthalpy: 0.326731 hartree
zpe.thermalcorrgfe: 0.258955 hartree
zpe.sumelectzpe: -690.906452 hartree
zpe.sumelectthermal: -690.888702 hartree
zpe.sumelectthermalent: -690.887758 hartree
zpe.sumelectthermalfe: -690.955533 hartree
dipole: 7.3795 0.7728 -1.8485
dipole: 7.6467
quadrupole: -129.0153 -92.6408 -94.4734
quadrupole: -3.1057 3.9698 -1.8095
quadrupole: -23.6388 12.7357 10.9031 -3.1057 3.9698 -1.8095
hfenergy: -691.2144889 hartree
pointgroup: C01 [X(C13H20N2O1)]
dipole: 2.8567782 -0.2678392 0.9042805 debye
polarizability: 238.3584321|0.2664231|133.1040234|17.8514744|-9.7211618|121.346587 unknown
InChI: InChI=1S/C13H20N2O/c1-10(2)7-8-15-12-5-3-11(4-6-12)9-13(14)16/h3-6,10,15H,7-9,14H2,1-2H3
charge 0 multiplicity 1
36 atoms
O  -6.151116 0.727918 -0.532109
N  1.505578 -0.957014 0.333757
N  -4.323712 0.966115 0.882978
C  5.177936 0.305692 0.394134
C  3.927388 -0.590781 0.621329
C  2.609259 -0.036718 0.041223
C  5.522062 0.469274 -1.106933
C  5.052346 1.683244 1.090331
C  0.187865 -0.752413 -0.068333
C  -2.550525 -0.375184 -0.89182
C  -0.205964 0.410219 -0.797573
C  -0.816969 -1.720657 0.241629
C  -1.548348 0.581647 -1.195114
C  -2.14939 -1.52988 -0.163881
C  -3.996221 -0.169208 -1.305797
C  -4.921488 0.544273 -0.288944
H  6.026016 -0.229391 0.87111
H  3.794374 -0.74491 1.712578
H  4.118807 -1.588078 0.172905
H  2.707459 0.102467 -1.0564
H  2.394818 0.96153 0.477422
H  4.752711 1.060136 -1.638213
H  6.486076 0.996267 -1.230347
H  5.604029 -0.512392 -1.610167
H  4.790822 1.572401 2.1595
H  6.006598 2.238224 1.029817
H  4.275701 2.310137 0.61375
H  1.727348 -1.818399 0.832216
H  0.53399 1.172233 -1.060551
H  -0.539725 -2.626514 0.796367
H  -1.822037 1.481086 -1.761505
H  -2.896343 -2.294892 0.083325
H  -4.064033 0.426431 -2.235356
H  -4.490799 -1.132758 -1.52922
H  -3.331672 0.802029 1.05313
H  -4.894439 1.443967 1.579262
