program: Gaussian 09
title: 000180185
version: EM64L-G09RevD.01
frameworkgroup: C1[X(C12H12O2S)]
method: RPBEPBE
basis: SDD
operation: Freq
keyword: #p
keyword: freq=noraman
keyword: PBEPBE/SDD
title: #p freq=noraman PBEPBE/SDD
converged: YES YES NO NO
title: Mulliken charges:
elementType: S O O C C C C C C C C C C C C H H H H H H H H H H H H
charge: 0.382556 -0.171716 -0.202109 -0.535202 -0.365961 0.489380 -0.342974 -0.136381 0.577965 -0.541100 -0.659675 0.212232 -0.696080 -0.242791 -0.524361 0.211638 0.233238 0.232651 0.202256 0.194787 0.202646 0.272925 0.218715 0.211088 0.215164 0.286759 0.274352
chargesum: 0.00000
title: Mulliken charges with hydrogens summed into heavy atoms:
elementType: S O O C C C C C C C C C C C C
charge: 0.382556 -0.171716 -0.202109 -0.090326 0.068946 0.489380 0.054459 -0.136381 0.577965 -0.268176 -0.659675 0.212232 -0.051113 0.043968 -0.250009
polarizability: 2.12379179e+02 7.96830386e+00 1.68187808e+02 1.76542694e+01 3.47003123e+00 8.43973245e+01
1716.lowfreq: -9.4194 -5.2707 0.0017 0.0022 0.0023 10.5969 37.0233 42.5785 70.3582
frequency: 36.9299 42.5180 70.2127 95.6603 122.5877 133.1381 169.5450 214.2144 216.2746 224.9825 236.7082 285.5712 338.3420 343.9365 430.7325 446.7061 448.2742 468.9829 536.4961 601.7373 618.1179 634.8663 676.5887 708.4344 735.3000 744.7040 770.5804 799.1005 842.9745 879.4613 890.2333 916.6971 924.2360 931.8938 980.7913 1014.7093 1035.0235 1064.8719 1088.4003 1103.4906 1113.5513 1183.7612 1208.6925 1238.2550 1258.2038 1273.4259 1288.7560 1291.0193 1317.1425 1334.2352 1344.7656 1390.9517 1399.3903 1454.9016 1462.1947 1468.2058 1476.9822 1477.1104 1487.9168 1509.3394 1547.4540 1553.7209 1623.3913 2967.0721 2974.8096 2980.3326 2994.8025 3012.5528 3040.4212 3064.3169 3073.4353 3074.9707 3140.1576 3194.7335 3238.3891
redmass: 4.9290 5.2776 1.5992 5.0883 2.5076 7.7895 5.6227 5.2772 4.0889 1.3635 3.1417 2.8444 8.1772 4.3626 5.4334 8.2589 6.5048 4.7657 7.3061 4.4503 4.4139 5.7042 5.4857 4.7345 1.0937 1.4129 3.9215 1.3349 3.8324 6.3295 1.7866 1.5415 1.3899 1.4439 4.5867 3.6499 3.0889 2.6353 1.2514 2.0715 1.5769 2.1491 1.4566 1.6104 1.3562 1.3026 1.1067 4.6780 1.4099 1.8522 1.5360 1.2123 5.2975 1.2285 4.8696 1.0691 1.0680 1.0424 1.0823 8.4788 10.3385 10.6729 7.7591 1.0585 1.0371 1.0603 1.0592 1.0979 1.1016 1.1038 1.1005 1.1006 1.0925 1.0921 1.1003
irintensity: 0.0766 1.5888 0.3578 5.7593 0.4854 0.7758 0.3831 0.4917 0.8948 0.2406 0.6396 0.5405 6.2497 6.3092 8.4526 3.1548 1.0306 1.0656 13.8664 2.5611 3.5137 0.6657 3.8572 0.1141 9.1912 82.0822 4.8063 0.4936 0.1444 33.6084 10.0143 10.0508 3.0951 16.8250 7.1384 24.9311 38.8680 5.1796 7.4057 31.6223 0.3485 18.6724 1.1054 51.3842 5.5423 2.6616 11.1796 122.6069 8.0708 12.3066 1.8525 11.8192 51.6512 5.6187 39.9775 0.3976 3.9949 12.9363 17.0296 13.7468 132.2437 263.7108 30.6668 25.7163 30.9442 24.7054 41.9225 8.6975 2.6877 3.1078 65.6063 75.5539 7.6142 2.2065 0.0582
temp: 298.150 k
press: 1.00000 atm
elementType: 16 8 8 6 6 6 6 6 6 6 6 6 6 6 6 1 1 1 1 1 1 1 1 1 1 1 1
symmnumber: 1
zpe: 545995.9 jmol-1
zpe.correction: 0.207959 hartree
zpe.thermalcorrener: 0.222332 hartree
zpe.thermalcorrenthalpy: 0.223277 hartree
zpe.thermalcorrgfe: 0.165463 hartree
zpe.sumelectzpe: -1011.882020 hartree
zpe.sumelectthermal: -1011.867646 hartree
zpe.sumelectthermalent: -1011.866702 hartree
zpe.sumelectthermalfe: -1011.924516 hartree
dipole: -0.5799 -1.6724 0.1340
dipole: 1.7751
quadrupole: -85.8349 -103.1664 -96.8205
quadrupole: -16.2316 1.2645 -3.5747
quadrupole: 9.4390 -7.8925 -1.5465 -16.2316 1.2645 -3.5747
hfenergy: -1012.0899789 hartree
pointgroup: C01 [X(C12H12O2S1)]
dipole: 0.2099601 -0.6545948 -0.1231933 debye
polarizability: 211.5223946|-11.1786609|168.5497108|17.722111|5.1909962|84.8922065 unknown
InChI: InChI=1S/C12H12O2S/c1-2-3-4-8-7-10(13)12-9(11(8)14)5-6-15-12/h5-7H,2-4H2,1H3
charge 0 multiplicity 1
27 atoms
S  -3.823889 0.327229 -0.530654
O  0.551479 -2.003519 0.473004
O  -1.970784 2.879356 0.101839
C  2.176004 0.310718 0.946972
C  3.045465 0.035512 -0.316847
C  0.704275 0.411954 0.622505
C  4.547514 -0.074535 0.028048
C  -0.035623 -0.880016 0.368081
C  -1.470457 -0.779035 0.003546
C  0.037772 1.610049 0.534392
C  -2.09456 0.47062 -0.080819
C  -1.401859 1.741338 0.176182
C  5.421358 -0.346632 -1.21496
C  -2.352571 -1.877749 -0.287508
C  -3.638724 -1.45938 -0.592252
H  2.520267 1.245211 1.427893
H  2.338171 -0.523095 1.656302
H  2.705582 -0.904751 -0.7906
H  2.890485 0.849214 -1.053637
H  4.88197 0.861523 0.520524
H  4.690639 -0.88747 0.768335
H  0.553002 2.559005 0.726301
H  6.490574 -0.424309 -0.945398
H  5.318875 0.465174 -1.959544
H  5.127029 -1.292704 -1.706518
H  -2.030989 -2.920631 -0.267376
H  -4.506506 -2.063779 -0.851313
