program: Gaussian 09
title: 000180224
version: EM64L-G09RevD.01
frameworkgroup: C1[X(C19H31NO4Si)]
method: RPBEPBE
basis: SDD
operation: Freq
keyword: #p
keyword: freq=noraman
keyword: PBEPBE/SDD
title: #p freq=noraman PBEPBE/SDD
converged: NO YES NO NO
title: Mulliken charges:
elementType: Si O O O O N C C C C C C C C C C C C C C C C C C C H H H H H H H H H H H H H H H H H H H H H H H H H H H H H H H
charge: 1.397973 -0.228945 -0.642949 -0.287870 -0.199016 0.003446 0.341972 0.223371 0.292782 -0.430175 -0.383569 -0.456246 -0.456602 -0.831724 -0.760488 -0.775003 0.290342 0.444703 -0.788061 -0.389253 -0.390018 -1.048107 -1.046722 -1.024204 -0.205322 0.214969 0.205719 0.271168 0.202516 0.197157 0.226280 0.196603 0.227072 0.242936 0.237287 0.221184 0.211046 0.247260 0.244363 0.200445 0.257951 0.250642 0.240594 0.250722 0.262224 0.279378 0.233991 0.270061 0.235650 0.232021 0.273566 0.236248 0.228733 0.242904 0.246396 0.262598
chargesum: 0.00000
title: Mulliken charges with hydrogens summed into heavy atoms:
elementType: Si O O O O N C C C C C C C C C C C C C C C C C C C
charge: 1.397973 -0.228945 -0.642949 -0.287870 -0.199016 0.003446 0.341972 0.223371 0.292782 -0.009487 -0.112401 -0.056573 -0.033719 -0.124428 -0.080998 -0.072245 0.290342 0.444703 -0.046102 -0.127030 -0.110641 -0.308404 -0.304887 -0.306172 0.057276
polarizability: 2.78862536e+02 -8.04931880e+00 2.29144927e+02 -3.81744341e+00 -1.49758176e+00 2.21932768e+02
1716.lowfreq: -12.8563 -8.9715 -0.0016 -0.0015 -0.0007 12.8274 14.7805 33.4320 57.9045
frequency: -6.5310 33.2796 57.8757 68.9350 73.7301 88.1544 98.0282 102.3651 109.5067 126.1483 129.3360 152.8331 158.9997 167.9415 179.6568 191.2405 194.4939 196.6920 219.7620 220.6497 222.9716 237.0071 242.6636 256.1492 261.8548 264.1869 279.1925 295.7831 302.9823 319.4096 322.6195 330.9697 341.6544 355.5518 366.4378 381.1517 420.3385 431.3204 468.2324 499.7318 505.3138 521.8971 568.4177 584.8068 589.4073 599.9300 620.4622 666.9963 685.1115 693.5505 703.7058 722.0173 729.1428 734.4568 739.8195 753.0877 781.5680 800.2889 813.8770 819.9252 830.0727 835.2779 848.7600 866.5050 874.6279 883.8159 898.8301 912.6332 918.9148 929.1791 936.7252 938.6859 957.4601 971.8946 978.0258 987.7654 989.5129 1010.2205 1014.0165 1028.4755 1039.0078 1049.9629 1062.9421 1088.6728 1094.8792 1134.0163 1144.7148 1150.2142 1170.8168 1186.6464 1207.0334 1215.6522 1232.0912 1238.3136 1247.8738 1259.1338 1271.2026 1282.0264 1289.8330 1299.2047 1300.5634 1304.8725 1312.7245 1332.8613 1336.2781 1353.7421 1375.4879 1384.6554 1390.2938 1395.7098 1396.2159 1435.8134 1443.4551 1447.1494 1447.5009 1448.2215 1454.0252 1457.7828 1462.5888 1464.7094 1466.3719 1471.8904 1472.9612 1475.3862 1476.8293 1481.6723 1487.9167 1493.7305 1501.6067 1571.4679 1607.2650 2936.5407 2976.3312 2977.0680 2981.6769 2982.6815 2984.7648 2986.7967 2986.9956 2993.3300 2995.5879 3000.3052 3031.6773 3037.9687 3048.6316 3060.0468 3074.4988 3075.6927 3079.0084 3083.3463 3086.6469 3089.5880 3091.4623 3095.0745 3103.6940 3103.8271 3110.7168 3114.4085 3127.9557 3220.1041 3249.2113 3268.6673
redmass: 3.0624 4.6060 3.6211 4.1200 3.6883 3.4743 3.7354 2.1034 2.0112 1.0381 2.5650 1.5352 2.7908 2.4273 2.7891 1.5098 2.2155 1.8022 1.5677 2.4731 2.1143 1.6864 1.7580 1.8809 3.9363 1.3057 1.8732 2.8455 3.3902 3.4896 4.0052 3.4353 2.7927 5.2994 3.9142 2.9527 2.7364 4.2845 4.4665 3.1133 3.8060 2.8179 8.0909 6.2766 3.9814 4.0252 3.2855 6.8552 2.6533 2.8171 2.8758 1.4986 3.4470 5.0363 2.8065 1.1707 1.5782 1.9993 1.4907 1.7041 2.0062 2.8177 5.9227 1.4634 2.2693 2.3055 3.1393 1.5089 1.6306 1.6560 2.2158 1.5005 2.2440 2.4266 1.6607 2.9647 1.7449 1.5677 1.8009 1.6790 2.2035 2.4904 2.2693 2.9993 2.1586 1.9718 2.2262 1.8363 2.4868 2.5824 1.5333 2.0829 3.2644 1.7777 1.7328 1.7073 2.0610 1.6551 2.1905 1.2451 1.3080 1.9575 1.2144 1.4109 1.3480 1.3716 1.1855 2.8988 1.2123 1.2323 1.1985 1.0533 1.0511 1.0568 1.0534 1.0487 1.0532 1.0613 1.0677 1.0769 1.0504 1.0942 1.0647 1.1164 3.1471 1.0783 1.0529 1.0554 1.0721 6.0396 8.1493 1.0799 1.0363 1.0362 1.0353 1.0548 1.0462 1.0347 1.0538 1.0425 1.0392 1.0615 1.0999 1.1020 1.0960 1.1029 1.0974 1.0972 1.0964 1.0989 1.0950 1.0982 1.0993 1.0984 1.0986 1.0998 1.0985 1.0960 1.0964 1.0929 1.0988 1.1075
irintensity: 0.1098 0.4699 1.0302 0.1449 1.0482 0.7711 1.5028 1.3229 2.0610 0.0182 1.7510 0.1163 0.7643 0.2906 0.3353 0.4380 1.5929 0.1592 0.4818 3.3848 1.3621 0.1959 3.1332 5.7688 0.7806 1.3351 3.2707 1.3591 4.5999 1.3663 21.8682 0.8733 2.7625 5.7956 4.9624 3.0664 1.1066 2.7930 3.6449 12.8560 1.2961 4.3679 13.7235 14.7474 14.3866 3.5844 21.4584 15.4420 7.3301 10.0337 10.5477 26.7778 64.3101 37.9930 2.0743 0.4932 93.0086 10.3125 24.3792 3.5015 17.9858 58.8159 29.9794 3.1503 13.1992 2.3554 14.3221 93.8550 119.8126 251.0202 10.4184 1.8008 10.7862 2.2476 6.9395 29.8637 24.5055 6.2250 16.5462 3.2260 29.7502 6.6807 110.3117 172.5360 18.0047 4.8901 3.0357 37.7229 3.8031 12.5180 2.1200 1.7359 59.0955 2.2972 2.0292 33.6711 5.9697 12.8445 16.7354 48.5789 42.7704 11.8517 29.5392 1.7586 2.9689 0.3675 14.3847 10.6823 28.6134 21.8762 14.3747 0.3024 7.3199 17.6409 3.6098 8.7409 0.9734 2.9387 11.6106 6.1625 6.0659 17.7193 12.6707 9.7160 10.7881 10.3077 9.7015 6.7708 14.2339 2.2231 83.3951 9.8980 2.9762 26.8547 11.6241 7.6594 15.2377 14.6736 42.2332 68.9073 26.4030 48.7206 39.5940 15.2923 14.3290 48.8369 31.8039 6.4864 29.7308 24.0503 28.2652 16.0379 17.2263 15.8289 21.3018 13.1965 7.0275 21.7655 17.1771 0.5207 0.6771 0.2483
temp: 298.150 k
press: 1.00000 atm
elementType: 14 8 8 8 8 7 6 6 6 6 6 6 6 6 6 6 6 6 6 6 6 6 6 6 6 1 1 1 1 1 1 1 1 1 1 1 1 1 1 1 1 1 1 1 1 1 1 1 1 1 1 1 1 1 1 1
symmnumber: 1
zpe: 1223093.8 jmol-1
zpe.correction: 0.465852 hartree
zpe.thermalcorrener: 0.493449 hartree
zpe.thermalcorrenthalpy: 0.494393 hartree
zpe.thermalcorrgfe: 0.411425 hartree
zpe.sumelectzpe: -1385.639492 hartree
zpe.sumelectthermal: -1385.611895 hartree
zpe.sumelectthermalent: -1385.610951 hartree
zpe.sumelectthermalfe: -1385.693918 hartree
dipole: 0.5360 0.3820 -2.3688
dipole: 2.4586
quadrupole: -153.2081 -152.8486 -170.9850
quadrupole: 2.7919 10.0827 4.7935
quadrupole: 5.8058 6.1653 -11.9711 2.7919 10.0827 4.7935
hfenergy: -1386.1053438 hartree
pointgroup: C01 [X(C19H31N1O4Si1)]
dipole: -0.2571143 -0.3512119 -0.863803 debye
polarizability: 277.6713561|-10.7245442|230.8243125|4.4410585|-0.5754015|221.4445614 unknown
InChI: InChI=1S/C19H31NO4Si/c1-14-16(15-9-12-22-13-15)18(4)11-8-10-17(2,3)19(18,23-20(14)21)24-25(5,6)7/h9,12-13,16H,8,10-11H2,1-7H3
charge 0 multiplicity 1
56 atoms
Si 2.870356 1.346765 -1.138923
O  1.308791 -0.032303 1.409453
O  1.678637 0.054319 -0.96372
O  0.941167 1.988706 2.532522
O  -4.565122 0.679472 -1.521442
N  0.454203 1.24295 1.600179
C  -0.396505 -0.925842 -0.15322
C  1.145983 -0.740407 0.102663
C  1.958644 -2.102435 0.314421
C  -1.042838 -1.695643 1.048822
C  -1.010969 0.522577 -0.293055
C  1.002976 -3.230672 0.831499
C  -0.091093 -2.691252 1.769462
C  -0.653805 -1.658239 -1.49546
C  2.605031 -2.552767 -1.022152
C  3.098208 -1.933821 1.362511
C  -0.612363 1.46345 0.83433
C  -2.518335 0.52924 -0.489267
C  -1.307023 2.783523 1.067513
C  -3.56724 0.342933 0.50439
C  -3.170377 0.734574 -1.694567
C  4.456235 1.10995 -0.110664
C  2.073468 3.017798 -0.685808
C  3.233842 1.249052 -3.003677
C  -4.778952 0.438799 -0.150919
H  -1.930328 -2.230257 0.661263
H  -1.413654 -0.971856 1.797398
H  -0.559779 0.932952 -1.223808
H  1.622887 -3.977255 1.364969
H  0.541789 -3.767982 -0.018735
H  0.393803 -2.181449 2.622294
H  -0.680985 -3.528522 2.188593
H  -0.379619 -2.723058 -1.450134
H  -1.728641 -1.608932 -1.743198
H  -0.081924 -1.183342 -2.31234
H  3.411817 -1.866247 -1.331564
H  3.045336 -3.558452 -0.881774
H  1.876139 -2.605546 -1.846462
H  2.702862 -1.776487 2.379074
H  3.710711 -2.855509 1.362809
H  3.758498 -1.086282 1.127422
H  -1.877672 2.78119 2.016262
H  -2.009315 2.993914 0.246048
H  -0.566349 3.600432 1.148898
H  -3.430232 0.17071 1.570245
H  -2.831435 0.924549 -2.709337
H  4.990382 0.178126 -0.366345
H  4.229584 1.11063 0.969606
H  5.139636 1.956909 -0.314891
H  1.08271 3.131613 -1.161687
H  1.958962 3.126323 0.407802
H  2.716518 3.844409 -1.044026
H  3.966401 2.019837 -3.306765
H  2.310775 1.402732 -3.590683
H  3.644653 0.259175 -3.271624
H  -5.818251 0.371751 0.156599
